<html>
<body>
<h1>EinsteinToolkit - Build #948 - Still Unstable</h1>
<p>Check console output at https://build.barrywardell.net/job/EinsteinToolkit/948/ to view the results.</p>
<h2>Changes</h2>
<pre>
[Einstein Toolkit Git Server] Updated submodules:
</pre>
<h2>Regressions</h2>
<pre>
10 tests failed.
... and 10 other failed tests.
</pre>
<h2>Failed tests</h2>
<pre>
10 tests failed.
FAILED: ADM.test_ADM_1/1procs
Error Message:
Stack Trace:
FAILED: ADM.test_ADM_2/1procs
Error Message:
Stack Trace:
FAILED: ADM.test_ADM_3/1procs
Error Message:
Stack Trace:
FAILED: ADM.test_ADM_4/1procs
Error Message:
Stack Trace:
FAILED: CarpetInterp.waveinterp-1p/1procs
Error Message:
WARNING level 0 in thorn Cactus processor 0 host build4.barrywardell.net
(line 201 of /home/jenkins/workspace/EinsteinToolkit/src/main/ProcessParameterDatabase.c):
-> CCTKi_SetParameterSetMask: 1 major error in parameter file
Stack Trace:
FAILED: ADM.test_ADM_1/2procs
Error Message:
Stack Trace:
FAILED: ADM.test_ADM_2/2procs
Error Message:
Stack Trace:
FAILED: ADM.test_ADM_3/2procs
Error Message:
Stack Trace:
FAILED: ADM.test_ADM_4/2procs
Error Message:
Stack Trace:
FAILED: CarpetInterp.waveinterp-2p/2procs
Error Message:
WARNING level 0 in thorn Cactus processor 1 host build4.barrywardell.net
(line 201 of /home/jenkins/workspace/EinsteinToolkit/src/main/ProcessParameterDatabase.c):
-> CCTKi_SetParameterSetMask: 1 major error in parameter file
WARNING level 1 in thorn Cactus processor 0 host build4.barrywardell.net
Stack Trace:
</pre>
<h2>Log</h2>
<pre>
[...truncated 14809 lines...]
Time -> Wed Dec 4 13:57:18 GMT 2013
Host -> build4
Processes -> 2
User -> jenkins
Total available tests -> 240
Unrunnable tests -> 42
Runnable tests -> 198
Total number of thorns -> 204
Number of tested thorns -> 60
Number of tests passed -> 193
Number passed only to
set tolerance -> 110
Number failed -> 5
Tests passed:
ADMConstraints_Mask (from ADMConstraints)
ADMConstraints_Physical (from ADMConstraints)
ADMConstraints_Shift (from ADMConstraints)
tov (from ADMMass)
tov_carpet (from ADMMass)
test_AHF_1 (from AHFinder)
test_AHF_2 (from AHFinder)
Kerr (from AHFinderDirect)
Kerr-Cartoon (from AHFinderDirect)
Kerr-Cartoon-EE (from AHFinderDirect)
Kerr-EE (from AHFinderDirect)
Kerr-definition-expansion (from AHFinderDirect)
Kerr-definition-expansion-EE (from AHFinderDirect)
Kerr-definition-expansion-product (from AHFinderDirect)
Kerr-definition-expansion-product-EE (from AHFinderDirect)
Kerr-definition-inner-expansion (from AHFinderDirect)
Kerr-definition-inner-expansion-EE (from AHFinderDirect)
Kerr-definition-mean-curvature (from AHFinderDirect)
Kerr-definition-mean-curvature-EE (from AHFinderDirect)
Kerr-modification-radius (from AHFinderDirect)
Kerr-modification-radius-EE (from AHFinderDirect)
Kerr-rotating-180 (from AHFinderDirect)
Kerr-rotating-180-EE (from AHFinderDirect)
Kerr-rotating-90 (from AHFinderDirect)
Kerr-rotating-90-EE (from AHFinderDirect)
Kerr-selection-areal-radius (from AHFinderDirect)
Kerr-selection-areal-radius-EE (from AHFinderDirect)
Kerr-selection-areal-radius-definition-expansion-product (from AHFinderDirect)
Kerr-selection-areal-radius-definition-expansion-product-EE (from AHFinderDirect)
Kerr-selection-mean-coordinate-radius (from AHFinderDirect)
Kerr-selection-mean-coordinate-radius-EE (from AHFinderDirect)
kasner (from Carpet)
kasner_amr (from Carpet)
no-overlap (from Carpet)
overlap (from Carpet)
buffer_mask (from CarpetEvolutionMask)
compact (from CarpetIOASCII)
coords (from CarpetIOASCII)
grid-coords (from CarpetIOASCII)
newsep (from CarpetIOASCII)
newsep (from CarpetIOHDF5)
nobuffers (from CarpetIOHDF5)
coords (from CarpetIOScalar)
coords2 (from CarpetIOScalar)
coords3 (from CarpetIOScalar)
coords4 (from CarpetIOScalar)
newsep (from CarpetIOScalar)
schw-0050 (from Cartoon2D)
test_cartoon_2 (from Cartoon2D)
test_cartoon_3 (from Cartoon2D)
E2xeon_test_dbh (from DistortedBHIVP)
test_dbh (from DistortedBHIVP)
eos_omni (from EOS_Omni)
Schwarzschild_EF (from Exact)
bowl-init (from Exact)
de_Sitter (from Exact)
extract_physical (from Extract)
GRHydro_test_shock (from GRHydro)
GRHydro_test_shock_mp5 (from GRHydro)
GRHydro_test_shock_ppm (from GRHydro)
GRHydro_test_shock_weno (from GRHydro)
GRHydro_test_tov_ppm_ML (from GRHydro)
GRHydro_test_tov_ppm_ML_disable_internal_excision (from GRHydro)
GRHydro_test_tov_ppm_no_trp_ML (from GRHydro)
balsara1_1d (from GRHydro)
balsara1_2d (from GRHydro)
balsara2_1d (from GRHydro)
balsara2_2d (from GRHydro)
balsara3_1d (from GRHydro)
balsara3_2d (from GRHydro)
balsara4_1d (from GRHydro)
balsara4_2d (from GRHydro)
balsara5_1d (from GRHydro)
balsara5_2d (from GRHydro)
cylexp_tvd_mc2_hlle (from GRHydro)
test_one_hybrid (from GRHydro)
test_tov_carpet_refined_nosync (from GRHydro)
tov_carpetevolutionmask (from GRHydro)
tov_carpetevolutionmask2 (from GRHydro)
tov_slowsector (from GRHydro)
diag_flip_pugh_eno (from Hydro_InitExcision)
diag_pugh_eno (from Hydro_InitExcision)
halfsphere_pugh_ppm (from Hydro_InitExcision)
sphere_pugh_ppm (from Hydro_InitExcision)
x_flip_pugh_eno (from Hydro_InitExcision)
x_pugh_eno (from Hydro_InitExcision)
kerr (from IDAnalyticBH)
test_bl (from IDAnalyticBH)
test_misner (from IDAnalyticBH)
test_axibrill (from IDAxiBrillBH)
test_axibrill_nostagger (from IDAxiBrillBH)
E2xeon_test_axioddbh (from IDAxiOddBrillBH)
test_axioddbh (from IDAxiOddBrillBH)
ConstraintViolate (from IDConstraintViolate)
test_pw_ADM_dir-x (from IDLinearWaves)
test_pw_ADM_dir-z (from IDLinearWaves)
test_waveell (from IDScalarWaveElliptic)
test_recover (from IOHDF5)
wavetoy (from InterpToArray)
wavetoy2 (from InterpToArray)
test-minkowski-carpet-1lev (from LoopControl)
ML_BSSN_EE_sgw3d (from ML_BSSN_Test)
ML_BSSN_EE_sgw3d_rhs (from ML_BSSN_Test)
ML_BSSN_NewRad (from ML_BSSN_Test)
ML_BSSN_O8_sgw3d (from ML_BSSN_Test)
ML_BSSN_sgw3d (from ML_BSSN_Test)
ML_BSSN_sgw3d_harmonic (from ML_BSSN_Test)
ML_BSSN_sgw3d_harmonic_phi (from ML_BSSN_Test)
ML_BSSN_sgw3d_rhs (from ML_BSSN_Test)
ML_CCZ4_sgw3d (from ML_CCZ4_Test)
ML_CCZ4_sgw3d_rhs (from ML_CCZ4_Test)
gaussian-RK4 (from ML_WaveToy_Test)
gaussian-RK45 (from ML_WaveToy_Test)
gaussian-RK45-adaptive (from ML_WaveToy_Test)
test_22 (from Multipole)
test_31 (from Multipole)
test_44 (from Multipole)
test_driscollhealy (from Multipole)
test_rads (from Multipole)
test_simpson (from Multipole)
test_trapezoidal (from Multipole)
test_vars (from Multipole)
nancount (from NaNChecker)
moving_tov (from Outflow)
ml-gw1d-small (from PeriodicCarpet)
ml-gw1d-small-amr (from PeriodicCarpet)
qlm-bl (from QuasiLocalMeasures)
qlm-ks (from QuasiLocalMeasures)
qlm-ks-EE (from QuasiLocalMeasures)
qlm-ks-boosted (from QuasiLocalMeasures)
qlm-ks-shifted (from QuasiLocalMeasures)
qlm-ks-tilted (from QuasiLocalMeasures)
qlm-minkowski (from QuasiLocalMeasures)
E2xeon_test_rdbh (from RotatingDBHIVP)
test_rdbh (from RotatingDBHIVP)
Kerr-EE (from RotatingSymmetry180)
Kerr-rotating-180-EE (from RotatingSymmetry180)
Kerr-rotating-180-staggered-EE (from RotatingSymmetry180)
Kerr-staggered-EE (from RotatingSymmetry180)
KerrSchild-rotating-180-EE (from RotatingSymmetry180)
Kerr-rotating-90-EE (from RotatingSymmetry90)
Kerr-rotating-90-staggered-EE (from RotatingSymmetry90)
KerrSchild-rotating-90-EE (from RotatingSymmetry90)
wavetoyc (from SampleBoundary)
slabtest (from SlabTest)
regression_test (from SphericalHarmonicRecon)
test_one_boost_max (from TOVSolver)
test_one_static_max (from TOVSolver)
test_tov_carpet (from TOVSolver)
test_two_av (from TOVSolver)
test_two_max (from TOVSolver)
arrays (from TestArrays)
arrays0 (from TestArrays)
TestComplex (from TestComplex)
TestComplexPow (from TestComplex)
test_fpointer_null (from TestFpointerNULL)
TestAvg (from TestGlobalReduce)
TestAvg_dest0 (from TestGlobalReduce)
TestMax (from TestGlobalReduce)
TestMax_dest0 (from TestGlobalReduce)
TestMin (from TestGlobalReduce)
TestMin_dest0 (from TestGlobalReduce)
TestScalar (from TestGlobalReduce)
TestSum (from TestGlobalReduce)
TestSum_dest0 (from TestGlobalReduce)
TestWeightAvg (from TestGlobalReduce)
TestWeightMax (from TestGlobalReduce)
TestWeightMin (from TestGlobalReduce)
TestWeightSum (from TestGlobalReduce)
gaussianMax (from TestGlobalReduce)
gaussianMax_dest0 (from TestGlobalReduce)
gaussianSum (from TestGlobalReduce)
gaussianSum_dest0 (from TestGlobalReduce)
TestAvg (from TestLocalReduce)
TestMax (from TestLocalReduce)
TestSum (from TestLocalReduce)
expressions (from TestPar)
trigger (from Trigger)
vectors (from Vectors)
test_binary_1 (from WaveBinarySource)
gaussian (from WaveMoL)
wavetoy1df77 (from WaveToy1DF77)
test_WaveToy2D (from WaveToy2DF77)
test_rad (from WaveToyC)
wave_output (from WaveToyC)
test_rad (from WaveToyCXX)
test_custom (from WaveToyExtra)
test_rad (from WaveToyF77)
test_rob (from WaveToyF77)
test_rad (from WaveToyF90)
test_wavef90_flat (from WaveToyF90)
test_wavef90_zero (from WaveToyF90)
test_rad (from WaveToyFreeF90)
Tests failed:
test_ADM_1 (from ADM)
test_ADM_2 (from ADM)
test_ADM_3 (from ADM)
test_ADM_4 (from ADM)
waveinterp-2p (from CarpetInterp)
========================================================================
------------------------------------------------------------------------
--- Menu ---
Run entire set of tests [E]
Run entire set of tests interactively [I]
Choose test from [T]horn or [A]rrangement
Rerun previous test [R]
Rerun previous test and show run output on screen [S]
Print tolerance table for data in previous test [P]
Compare all files in the test output directories [O]
Customize testsuite checking [C]
Quit [Q]
Wed Dec 4 13:57:18 GMT 2013
Simfactory Done at date: 0
real        27m47.445s
user        42m2.862s
sys        3m28.433s
Archiving artifacts
Recording test results
Build step 'Publish JUnit test result report' changed build result to UNSTABLE
IRC notifier plugin: Sending notification to: #cactus
Email was triggered for: Improvement
Sending email for trigger: Improvement
</pre>
</body>
</html>