lists.einsteintoolkit.org
Sign In
Sign Up
Sign In
Sign Up
Manage this list
×
Keyboard Shortcuts
Thread View
j
: Next unread message
k
: Previous unread message
j a
: Jump to all threads
j l
: Jump to MailingList overview
2026
October
September
August
July
June
May
April
March
February
January
2025
December
November
October
September
August
July
June
May
April
March
February
January
2024
December
November
October
September
August
July
June
May
April
March
February
January
2023
December
November
October
September
August
July
June
May
April
March
February
January
2022
December
November
October
September
August
July
June
May
April
March
February
January
2021
December
November
October
September
August
July
June
May
April
March
February
January
2020
December
November
October
September
August
July
June
May
April
March
February
January
2019
December
November
October
September
August
July
June
May
April
March
February
January
2018
December
November
October
September
August
July
June
May
April
March
February
January
2017
December
November
October
September
August
July
June
May
April
March
February
January
2016
December
November
October
September
August
July
June
May
April
March
February
January
2015
December
November
October
September
August
July
June
May
April
March
February
January
2014
December
November
October
September
August
July
June
May
April
March
February
January
2013
December
November
October
September
August
List overview
Download
Test
----- 2026 -----
October 2026
September 2026
August 2026
July 2026
June 2026
May 2026
April 2026
March 2026
February 2026
January 2026
----- 2025 -----
December 2025
November 2025
October 2025
September 2025
August 2025
July 2025
June 2025
May 2025
April 2025
March 2025
February 2025
January 2025
----- 2024 -----
December 2024
November 2024
October 2024
September 2024
August 2024
July 2024
June 2024
May 2024
April 2024
March 2024
February 2024
January 2024
----- 2023 -----
December 2023
November 2023
October 2023
September 2023
August 2023
July 2023
June 2023
May 2023
April 2023
March 2023
February 2023
January 2023
----- 2022 -----
December 2022
November 2022
October 2022
September 2022
August 2022
July 2022
June 2022
May 2022
April 2022
March 2022
February 2022
January 2022
----- 2021 -----
December 2021
November 2021
October 2021
September 2021
August 2021
July 2021
June 2021
May 2021
April 2021
March 2021
February 2021
January 2021
----- 2020 -----
December 2020
November 2020
October 2020
September 2020
August 2020
July 2020
June 2020
May 2020
April 2020
March 2020
February 2020
January 2020
----- 2019 -----
December 2019
November 2019
October 2019
September 2019
August 2019
July 2019
June 2019
May 2019
April 2019
March 2019
February 2019
January 2019
----- 2018 -----
December 2018
November 2018
October 2018
September 2018
August 2018
July 2018
June 2018
May 2018
April 2018
March 2018
February 2018
January 2018
----- 2017 -----
December 2017
November 2017
October 2017
September 2017
August 2017
July 2017
June 2017
May 2017
April 2017
March 2017
February 2017
January 2017
----- 2016 -----
December 2016
November 2016
October 2016
September 2016
August 2016
July 2016
June 2016
May 2016
April 2016
March 2016
February 2016
January 2016
----- 2015 -----
December 2015
November 2015
October 2015
September 2015
August 2015
July 2015
June 2015
May 2015
April 2015
March 2015
February 2015
January 2015
----- 2014 -----
December 2014
November 2014
October 2014
September 2014
August 2014
July 2014
June 2014
May 2014
April 2014
March 2014
February 2014
January 2014
----- 2013 -----
December 2013
November 2013
October 2013
September 2013
August 2013
test@lists.einsteintoolkit.org
431 discussions
Start a n
N
ew thread
EinsteinToolkit - Build #1020 - Failure
by ian.hinder@aei.mpg.de
07 Feb '14
07 Feb '14
4
9
0
0
Build failed in Jenkins: EinsteinToolkitReleased #25
by ian.hinder@aei.mpg.de
13 Jan '14
13 Jan '14
See <
https://build.barrywardell.net/job/EinsteinToolkitReleased/25/changes
> Changes: [Einstein Toolkit Git Server] Updated submodules: ------------------------------------------ [...truncated 18693 lines...] <
https://build.barrywardell.net/job/EinsteinToolkitReleased/ws/configs/sim/b…
>: In function ‘grhydro_hllem_._omp_fn.0’: <
https://build.barrywardell.net/job/EinsteinToolkitReleased/ws/configs/sim/b…
>:579:0: warning: ‘psidcfm’ may be used uninitialized in this function [-Wuninitialized] <
https://build.barrywardell.net/job/EinsteinToolkitReleased/ws/configs/sim/b…
>:58:0: note: ‘psidcfm’ was declared here <
https://build.barrywardell.net/job/EinsteinToolkitReleased/ws/configs/sim/b…
>:579:0: warning: ‘psidcfp’ may be used uninitialized in this function [-Wuninitialized] <
https://build.barrywardell.net/job/EinsteinToolkitReleased/ws/configs/sim/b…
>:58:0: note: ‘psidcfp’ was declared here <
https://build.barrywardell.net/job/EinsteinToolkitReleased/ws/configs/sim/b…
>:415:0: warning: ‘psidcp’ may be used uninitialized in this function [-Wuninitialized] <
https://build.barrywardell.net/job/EinsteinToolkitReleased/ws/configs/sim/b…
>:58:0: note: ‘psidcp’ was declared here <
https://build.barrywardell.net/job/EinsteinToolkitReleased/ws/configs/sim/b…
>:574:0: warning: ‘psidcm’ may be used uninitialized in this function [-Wuninitialized] <
https://build.barrywardell.net/job/EinsteinToolkitReleased/ws/configs/sim/b…
>:58:0: note: ‘psidcm’ was declared here <
https://build.barrywardell.net/job/EinsteinToolkitReleased/ws/configs/sim/b…
>:624:0: warning: ‘entropyfm’ may be used uninitialized in this function [-Wuninitialized] <
https://build.barrywardell.net/job/EinsteinToolkitReleased/ws/configs/sim/b…
>:56:0: note: ‘entropyfm’ was declared here <
https://build.barrywardell.net/job/EinsteinToolkitReleased/ws/configs/sim/b…
>:624:0: warning: ‘entropyfp’ may be used uninitialized in this function [-Wuninitialized] <
https://build.barrywardell.net/job/EinsteinToolkitReleased/ws/configs/sim/b…
>:56:0: note: ‘entropyfp’ was declared here <
https://build.barrywardell.net/job/EinsteinToolkitReleased/ws/configs/sim/b…
>:299:0: warning: ‘entropyconsp’ may be used uninitialized in this function [-Wuninitialized] <
https://build.barrywardell.net/job/EinsteinToolkitReleased/ws/configs/sim/b…
>:56:0: note: ‘entropyconsp’ was declared here <
https://build.barrywardell.net/job/EinsteinToolkitReleased/ws/configs/sim/b…
>:621:0: warning: ‘entropyconsm’ may be used uninitialized in this function [-Wuninitialized] <
https://build.barrywardell.net/job/EinsteinToolkitReleased/ws/configs/sim/b…
>:56:0: note: ‘entropyconsm’ was declared here <
https://build.barrywardell.net/job/EinsteinToolkitReleased/ws/configs/sim/b…
>:645:0: warning: ‘psidcf’ may be used uninitialized in this function [-Wuninitialized] <
https://build.barrywardell.net/job/EinsteinToolkitReleased/ws/configs/sim/b…
>:58:0: note: ‘psidcf’ was declared here <
https://build.barrywardell.net/job/EinsteinToolkitReleased/ws/configs/sim/b…
>:649:0: warning: ‘entropyf’ may be used uninitialized in this function [-Wuninitialized] <
https://build.barrywardell.net/job/EinsteinToolkitReleased/ws/configs/sim/b…
>:56:0: note: ‘entropyf’ was declared here COMPILING <
https://build.barrywardell.net/job/EinsteinToolkitReleased/ws/arrangements/…
> <
https://build.barrywardell.net/job/EinsteinToolkitReleased/ws/arrangements/…
>:33.42: subroutine SimplePPM_1dM(handle,poly,nx,dx,& 1 Warning: Unused dummy argument 'dx' at (1) COMPILING <
https://build.barrywardell.net/job/EinsteinToolkitReleased/ws/arrangements/…
> <
https://build.barrywardell.net/job/EinsteinToolkitReleased/ws/arrangements/…
>:170.42: subroutine GRHydro_WENOReconstruct1d(order, nx, v, vminus, vplus, trivial_rp, & 1 Warning: Unused dummy argument 'order' at (1) Formaline: Adding thorn NoExcision to git repository... Creating <
https://build.barrywardell.net/job/EinsteinToolkitReleased/ws/configs/sim/l…
> Creating Formaline tarball for thorn Carpet Creating Formaline tarball for thorn CarpetEvolutionMask Creating Formaline tarball for thorn CarpetIOASCII Creating Formaline tarball for thorn CarpetIOBasic Creating Formaline tarball for thorn CarpetIOHDF5 Creating Formaline tarball for thorn CarpetIOScalar Creating Formaline tarball for thorn CarpetInterp Creating Formaline tarball for thorn CarpetInterp2 Creating Formaline tarball for thorn CarpetReduce Creating Formaline tarball for thorn CarpetRegrid Creating Formaline tarball for thorn CarpetRegrid2 Creating Formaline tarball for thorn CarpetSlab Creating Formaline tarball for thorn NullConstr Creating Formaline tarball for thorn PeriodicCarpet Formaline: Adding thorn GRHydro to git repository... Formaline: Committing source tree to git repository... Creating Formaline tarball for thorn NoExcision Creating Formaline tarball for thorn GRHydro Formaline: Created git tag build-sim-cactus-test.cct.lsu.edu-jenkins-2014.01.13-20.07.32-30401 Formaline: Updated git branch config-sim-cactus-test.cct.lsu.edu-home-jenkins-workspace-EinsteinToolkitReleased ________________________________________________________________________ Creating cactus_sim in <
https://build.barrywardell.net/job/EinsteinToolkitReleased/ws/exe
> from CactusArchive/ADM EinsteinAnalysis/ADMAnalysis EinsteinBase/ADMBase EinsteinAnalysis/ADMConstraints EinsteinBase/ADMCoupling EinsteinBase/ADMMacros AEIThorns/ADMMass AEIThorns/AEILocalInterp EinsteinAnalysis/AHFinder EinsteinAnalysis/AHFinderDirect ExternalLibraries/BLAS CactusBase/Boundary EinsteinAnalysis/CalcK Carpet/Carpet Carpet/CarpetEvolutionMask Carpet/CarpetIOASCII Carpet/CarpetIOBasic Carpet/CarpetIOHDF5 Carpet/CarpetIOScalar Carpet/CarpetInterp Carpet/CarpetInterp2 Carpet/CarpetLib Carpet/CarpetMask Carpet/CarpetReduce Carpet/CarpetRegrid Carpet/CarpetRegrid2 Carpet/CarpetSlab Carpet/CarpetTracker CactusBase/CartGrid3D CactusNumerical/Cartoon2D EinsteinBase/Constants CactusBase/CoordBase EinsteinBase/CoordGauge CactusDoc/CoreDoc Carpet/CycleClock CactusNumerical/Dissipation EinsteinInitialData/DistortedBHIVP EinsteinAnalysis/EHFinder EinsteinBase/EOS_Base EinsteinEOS/EOS_Hybrid EinsteinEOS/EOS_IdealFluid EinsteinEOS/EOS_Omni EinsteinEOS/EOS_Polytrope EinsteinExact/EinsteinExact_Test CactusElliptic/EllBase CactusElliptic/EllSOR EinsteinInitialData/Exact EinsteinAnalysis/Extract ExternalLibraries/FFTW3 CactusUtils/Formaline CactusBase/Fortran EinsteinEvolve/GRHydro EinsteinInitialData/GRHydro_InitData ExternalLibraries/GSL EinsteinExact/GaugeWave KrancNumericalTools/GenericFD ExternalLibraries/HDF5 CactusConnect/HTTPD CactusConnect/HTTPDExtra EinsteinBase/HydroBase EinsteinAnalysis/Hydro_Analysis EinsteinInitialData/Hydro_InitExcision EinsteinInitialData/IDAnalyticBH EinsteinInitialData/IDAxiBrillBH EinsteinInitialData/IDAxiOddBrillBH EinsteinInitialData/IDBrillData EinsteinInitialData/IDConstraintViolate EinsteinInitialData/IDFileADM EinsteinInitialData/IDLinearWaves CactusWave/IDScalarWave CactusWave/IDScalarWaveC CactusWave/IDScalarWaveCXX CactusWave/IDScalarWaveElliptic CactusBase/IOASCII CactusBase/IOBasic CactusPUGHIO/IOHDF5 CactusPUGHIO/IOHDF5Util CactusIO/IOJpeg CactusBase/IOUtil CactusBase/InitBase CactusNumerical/InterpToArray EinsteinExact/KerrSchild ExternalLibraries/LAPACK ExternalLibraries/LORENE EinsteinEvolve/LegoExcision CactusNumerical/LocalInterp CactusNumerical/LocalReduce Carpet/LoopControl McLachlan/ML_ADMConstraints McLachlan/ML_ADMQuantities McLachlan/ML_BSSN McLachlan/ML_BSSN_Helper McLachlan/ML_BSSN_Test McLachlan/ML_CCZ4 McLachlan/ML_CCZ4_Helper McLachlan/ML_CCZ4_Test McLachlan/ML_WaveToy McLachlan/ML_WaveToy_Test ExternalLibraries/MPI EinsteinInitialData/Meudon_Bin_BH EinsteinInitialData/Meudon_Bin_NS EinsteinInitialData/Meudon_Mag_NS EinsteinExact/Minkowski CactusNumerical/MoL EinsteinExact/ModifiedSchwarzschildBL EinsteinAnalysis/Multipole CactusUtils/NaNChecker EinsteinEvolve/NewRad CactusUtils/Nice EinsteinInitialData/NoExcision CactusUtils/NoMPI CactusNumerical/Noise CactusNumerical/Norms PITTNullCode/NullConstr PITTNullCode/NullDecomp PITTNullCode/NullEvolve PITTNullCode/NullExact PITTNullCode/NullGrid PITTNullCode/NullInterp PITTNullCode/NullNews PITTNullCode/NullPsiInt PITTNullCode/NullSHRExtract PITTNullCode/NullVars ExternalLibraries/OpenSSL EinsteinAnalysis/Outflow CactusPUGH/PUGH CactusPUGH/PUGHInterp CactusPUGH/PUGHReduce CactusPUGH/PUGHSlab CactusNumerical/Periodic LSUThorns/PeriodicCarpet AEIThorns/PunctureTracker LSUThorns/QuasiLocalMeasures CactusNumerical/ReflectionSymmetry EinsteinInitialData/RotatingDBHIVP CactusNumerical/RotatingSymmetry180 CactusNumerical/RotatingSymmetry90 EinsteinUtils/SetMask_SphericalSurface EinsteinExact/ShiftedGaugeWave CactusNumerical/Slab CactusNumerical/SlabTest CactusConnect/Socket CactusNumerical/SpaceMask PITTNullCode/SphericalHarmonicDecomp PITTNullCode/SphericalHarmonicRecon CactusNumerical/SphericalSurface EinsteinBase/StaticConformal LSUThorns/SummationByParts CactusBase/SymBase AEIThorns/SystemStatistics TAT/TATelliptic EinsteinUtils/TGRtensor EinsteinInitialData/TOVSolver CactusUtils/TerminationTrigger CactusTest/TestArrays CactusTest/TestComplex CactusTest/TestCoordinates CactusTest/TestFortranCrayPointers CactusTest/TestFortranDependencies1 CactusTest/TestFortranDependencies2 CactusTest/TestFpointerNULL CactusTest/TestFreeF90 CactusTest/TestGlobalReduce CactusTest/TestInclude1 CactusTest/TestInclude2 CactusTest/TestLocalReduce CactusTest/TestLoop CactusTest/TestMath CactusTest/TestPar CactusTest/TestReduce CactusTest/TestSchedule CactusTest/TestStrings CactusTest/TestTable CactusTest/TestTimers CactusTest/TestTypes CactusBase/Time CactusUtils/TimerReport Carpet/Timers EinsteinBase/TmunuBase AEIThorns/Trigger EinsteinInitialData/TwoPunctures EinsteinExact/Vaidya2 LSUThorns/Vectors CactusWave/WaveBinarySource CactusWave/WaveToyC CactusWave/WaveToyCXX CactusWave/WaveToyExtra CactusWave/WaveToyF77 CactusWave/WaveToyF90 CactusWave/WaveToyFreeF90 EinsteinAnalysis/WeylScal4 ExternalLibraries/hwloc ExternalLibraries/libjpeg ExternalLibraries/zlib Formaline: Pushing source tree to master git repository... Formaline: Pushing to local repository <
https://build.barrywardell.net/job/EinsteinToolkitReleased/ws/../CactusSour…
...> Done creating cactus_sim. Formaline: Done. Formaline: (Formaline has finished updating the git repositories. Formaline: If the build process seems to hang, some other command Formaline: is still running, e.g. the final link stage.) All done ! Building utilities for sim Building utilities for sim Compiling <
https://build.barrywardell.net/job/EinsteinToolkitReleased/ws/arrangements/…
> Compiling <
https://build.barrywardell.net/job/EinsteinToolkitReleased/ws/arrangements/…
> Compiling <
https://build.barrywardell.net/job/EinsteinToolkitReleased/ws/arrangements/…
> Compiling <
https://build.barrywardell.net/job/EinsteinToolkitReleased/ws/arrangements/…
> Compiling <
https://build.barrywardell.net/job/EinsteinToolkitReleased/ws/arrangements/…
> Compiling <
https://build.barrywardell.net/job/EinsteinToolkitReleased/ws/arrangements/…
> Copying gif2h5 from /usr/bin/gif2h5 to <
https://build.barrywardell.net/job/EinsteinToolkitReleased/ws/exe/sim
> Copying h52gif from /usr/bin/h52gif to <
https://build.barrywardell.net/job/EinsteinToolkitReleased/ws/exe/sim
> Copying h5copy from /usr/bin/h5copy to <
https://build.barrywardell.net/job/EinsteinToolkitReleased/ws/exe/sim
> Copying h5debug from /usr/bin/h5debug to <
https://build.barrywardell.net/job/EinsteinToolkitReleased/ws/exe/sim
> Copying h5diff from /usr/bin/h5diff to <
https://build.barrywardell.net/job/EinsteinToolkitReleased/ws/exe/sim
> Copying h5dump from /usr/bin/h5dump to <
https://build.barrywardell.net/job/EinsteinToolkitReleased/ws/exe/sim
> Copying h5import from /usr/bin/h5import to <
https://build.barrywardell.net/job/EinsteinToolkitReleased/ws/exe/sim
> Copying h5jam from /usr/bin/h5jam to <
https://build.barrywardell.net/job/EinsteinToolkitReleased/ws/exe/sim
> Copying h5ls from /usr/bin/h5ls to <
https://build.barrywardell.net/job/EinsteinToolkitReleased/ws/exe/sim
> Copying h5mkgrp from /usr/bin/h5mkgrp to <
https://build.barrywardell.net/job/EinsteinToolkitReleased/ws/exe/sim
> Copying h5perf_serial from /usr/bin/h5perf_serial to <
https://build.barrywardell.net/job/EinsteinToolkitReleased/ws/exe/sim
> Copying h5redeploy from /usr/bin/h5redeploy to <
https://build.barrywardell.net/job/EinsteinToolkitReleased/ws/exe/sim
> Copying h5repack from /usr/bin/h5repack to <
https://build.barrywardell.net/job/EinsteinToolkitReleased/ws/exe/sim
> Copying h5repart from /usr/bin/h5repart to <
https://build.barrywardell.net/job/EinsteinToolkitReleased/ws/exe/sim
> Copying h5stat from /usr/bin/h5stat to <
https://build.barrywardell.net/job/EinsteinToolkitReleased/ws/exe/sim
> Copying h5unjam from /usr/bin/h5unjam to <
https://build.barrywardell.net/job/EinsteinToolkitReleased/ws/exe/sim
> Compiling <
https://build.barrywardell.net/job/EinsteinToolkitReleased/ws/arrangements/…
> Compiling <
https://build.barrywardell.net/job/EinsteinToolkitReleased/ws/arrangements/…
> Compiling <
https://build.barrywardell.net/job/EinsteinToolkitReleased/ws/arrangements/…
> Compiling <
https://build.barrywardell.net/job/EinsteinToolkitReleased/ws/arrangements/…
> Copying mpirun from /usr/bin/mpirun to <
https://build.barrywardell.net/job/EinsteinToolkitReleased/ws/exe/sim
> Compiling <
https://build.barrywardell.net/job/EinsteinToolkitReleased/ws/arrangements/…
> Copying hwloc-assembler from <
https://build.barrywardell.net/job/EinsteinToolkitReleased/ws/configs/sim/s…
> to <
https://build.barrywardell.net/job/EinsteinToolkitReleased/ws/exe/sim
> Copying hwloc-assembler-remote from <
https://build.barrywardell.net/job/EinsteinToolkitReleased/ws/configs/sim/s…
> to <
https://build.barrywardell.net/job/EinsteinToolkitReleased/ws/exe/sim
> Copying hwloc-bind from /usr/bin/hwloc-bind to <
https://build.barrywardell.net/job/EinsteinToolkitReleased/ws/exe/sim
> Copying hwloc-calc from /usr/bin/hwloc-calc to <
https://build.barrywardell.net/job/EinsteinToolkitReleased/ws/exe/sim
> Copying hwloc-distances from <
https://build.barrywardell.net/job/EinsteinToolkitReleased/ws/configs/sim/s…
> to <
https://build.barrywardell.net/job/EinsteinToolkitReleased/ws/exe/sim
> Copying hwloc-distrib from /usr/bin/hwloc-distrib to <
https://build.barrywardell.net/job/EinsteinToolkitReleased/ws/exe/sim
> Copying hwloc-info from /usr/bin/hwloc-info to <
https://build.barrywardell.net/job/EinsteinToolkitReleased/ws/exe/sim
> Copying hwloc-ls from /usr/bin/hwloc-ls to <
https://build.barrywardell.net/job/EinsteinToolkitReleased/ws/exe/sim
> Copying hwloc-ps from /usr/bin/hwloc-ps to <
https://build.barrywardell.net/job/EinsteinToolkitReleased/ws/exe/sim
> Copying lstopo from /usr/bin/lstopo to <
https://build.barrywardell.net/job/EinsteinToolkitReleased/ws/exe/sim
> Copying lstopo-no-graphics from <
https://build.barrywardell.net/job/EinsteinToolkitReleased/ws/configs/sim/s…
> to <
https://build.barrywardell.net/job/EinsteinToolkitReleased/ws/exe/sim
> Creating carpet2xgraph in <
https://build.barrywardell.net/job/EinsteinToolkitReleased/ws/exe/sim
> from <
https://build.barrywardell.net/job/EinsteinToolkitReleased/ws/configs/sim/b…
> Creating hdf5toascii_slicer in <
https://build.barrywardell.net/job/EinsteinToolkitReleased/ws/exe/sim
> from <
https://build.barrywardell.net/job/EinsteinToolkitReleased/ws/configs/sim/b…
> Creating hdf5tobinary_slicer in <
https://build.barrywardell.net/job/EinsteinToolkitReleased/ws/exe/sim
> from <
https://build.barrywardell.net/job/EinsteinToolkitReleased/ws/configs/sim/b…
> Creating hdf5_slicer in <
https://build.barrywardell.net/job/EinsteinToolkitReleased/ws/exe/sim
> from <
https://build.barrywardell.net/job/EinsteinToolkitReleased/ws/configs/sim/b…
> Creating hdf5_recombiner in <
https://build.barrywardell.net/job/EinsteinToolkitReleased/ws/exe/sim
> from <
https://build.barrywardell.net/job/EinsteinToolkitReleased/ws/configs/sim/b…
> Creating Riemann1d in <
https://build.barrywardell.net/job/EinsteinToolkitReleased/ws/exe/sim
> from <
https://build.barrywardell.net/job/EinsteinToolkitReleased/ws/configs/sim/b…
> Creating hdf5_merge in <
https://build.barrywardell.net/job/EinsteinToolkitReleased/ws/exe/sim
> from <
https://build.barrywardell.net/job/EinsteinToolkitReleased/ws/configs/sim/b…
> Creating hdf5_extract in <
https://build.barrywardell.net/job/EinsteinToolkitReleased/ws/exe/sim
> from <
https://build.barrywardell.net/job/EinsteinToolkitReleased/ws/configs/sim/b…
> Creating hdf5_double_to_single in <
https://build.barrywardell.net/job/EinsteinToolkitReleased/ws/exe/sim
> from <
https://build.barrywardell.net/job/EinsteinToolkitReleased/ws/configs/sim/b…
> Creating hdf5_convert_from_carpetiohdf5 in <
https://build.barrywardell.net/job/EinsteinToolkitReleased/ws/exe/sim
> from <
https://build.barrywardell.net/job/EinsteinToolkitReleased/ws/configs/sim/b…
> Compiling <
https://build.barrywardell.net/job/EinsteinToolkitReleased/ws/arrangements/…
> Compiling <
https://build.barrywardell.net/job/EinsteinToolkitReleased/ws/arrangements/…
> <
https://build.barrywardell.net/job/EinsteinToolkitReleased/ws/arrangements/…
>: In function ‘write_meta’: <
https://build.barrywardell.net/job/EinsteinToolkitReleased/ws/arrangements/…
>:439:11: warning: variable ‘status’ set but not used [-Wunused-but-set-variable] <
https://build.barrywardell.net/job/EinsteinToolkitReleased/ws/arrangements/…
>: In function ‘write_out_data_for_component’: <
https://build.barrywardell.net/job/EinsteinToolkitReleased/ws/arrangements/…
>:492:11: warning: variable ‘status’ set but not used [-Wunused-but-set-variable] <
https://build.barrywardell.net/job/EinsteinToolkitReleased/ws/arrangements/…
>: In function ‘read_meta’: <
https://build.barrywardell.net/job/EinsteinToolkitReleased/ws/arrangements/…
>:599:11: warning: variable ‘status’ set but not used [-Wunused-but-set-variable] <
https://build.barrywardell.net/job/EinsteinToolkitReleased/ws/arrangements/…
>: In function ‘read_meta’: <
https://build.barrywardell.net/job/EinsteinToolkitReleased/ws/arrangements/…
>:213:11: warning: variable ‘status’ set but not used [-Wunused-but-set-variable] Compiling <
https://build.barrywardell.net/job/EinsteinToolkitReleased/ws/arrangements/…
> Compiling <
https://build.barrywardell.net/job/EinsteinToolkitReleased/ws/arrangements/…
> <
https://build.barrywardell.net/job/EinsteinToolkitReleased/ws/arrangements/…
>: In function ‘write_meta’: <
https://build.barrywardell.net/job/EinsteinToolkitReleased/ws/arrangements/…
>:72:11: warning: variable ‘status’ set but not used [-Wunused-but-set-variable] Compiling <
https://build.barrywardell.net/job/EinsteinToolkitReleased/ws/arrangements/…
> Compiling <
https://build.barrywardell.net/job/EinsteinToolkitReleased/ws/arrangements/…
> <
https://build.barrywardell.net/job/EinsteinToolkitReleased/ws/arrangements/…
>: In function ‘main’: <
https://build.barrywardell.net/job/EinsteinToolkitReleased/ws/arrangements/…
>:39:10: warning: ignoring return value of ‘freopen’, declared with attribute warn_unused_result [-Wunused-result] Creating ascii_output in <
https://build.barrywardell.net/job/EinsteinToolkitReleased/ws/exe/sim
> from <
https://build.barrywardell.net/job/EinsteinToolkitReleased/ws/configs/sim/b…
> <
https://build.barrywardell.net/job/EinsteinToolkitReleased/ws/arrangements/…
>: In function ‘read_meta’: <
https://build.barrywardell.net/job/EinsteinToolkitReleased/ws/arrangements/…
>:27:11: warning: variable ‘status’ set but not used [-Wunused-but-set-variable] <
https://build.barrywardell.net/job/EinsteinToolkitReleased/ws/arrangements/…
>: In function ‘main’: <
https://build.barrywardell.net/job/EinsteinToolkitReleased/ws/arrangements/…
>:36:15: warning: variable ‘status’ set but not used [-Wunused-but-set-variable] Creating fftwfilter in <
https://build.barrywardell.net/job/EinsteinToolkitReleased/ws/exe/sim
> from <
https://build.barrywardell.net/job/EinsteinToolkitReleased/ws/configs/sim/b…
> Creating setmeta in <
https://build.barrywardell.net/job/EinsteinToolkitReleased/ws/exe/sim
> from <
https://build.barrywardell.net/job/EinsteinToolkitReleased/ws/configs/sim/b…
> Creating findlast in <
https://build.barrywardell.net/job/EinsteinToolkitReleased/ws/exe/sim
> from <
https://build.barrywardell.net/job/EinsteinToolkitReleased/ws/configs/sim/b…
> Creating printtime in <
https://build.barrywardell.net/job/EinsteinToolkitReleased/ws/exe/sim
> from <
https://build.barrywardell.net/job/EinsteinToolkitReleased/ws/configs/sim/b…
> Creating readmeta in <
https://build.barrywardell.net/job/EinsteinToolkitReleased/ws/exe/sim
> from <
https://build.barrywardell.net/job/EinsteinToolkitReleased/ws/configs/sim/b…
> Done. real 12m31.976s user 28m17.562s sys 10m1.002s real 12m36.601s user 28m20.206s sys 10m2.854s Skeleton Created Job directory: "<
https://build.barrywardell.net/job/EinsteinToolkitReleased/ws/../simulation…
"> Option --testsuite given Traceback (most recent call last): File "simfactory/bin/../lib/sim.py", line 148, in <module> main() File "simfactory/bin/../lib/sim.py", line 144, in main CommandDispatch() File "simfactory/bin/../lib/sim.py", line 106, in CommandDispatch module.main() File "<
https://build.barrywardell.net/job/EinsteinToolkitReleased/ws/simfactory/li…
",> line 397, in main CommandDispatch() File "<
https://build.barrywardell.net/job/EinsteinToolkitReleased/ws/simfactory/li…
",> line 376, in CommandDispatch exec("command_%s()" % command) File "<string>", line 1, in <module> File "<
https://build.barrywardell.net/job/EinsteinToolkitReleased/ws/simfactory/li…
",> line 178, in command_create_run command_create() File "<
https://build.barrywardell.net/job/EinsteinToolkitReleased/ws/simfactory/li…
",> line 138, in command_create restart.create(simulationName, parfile) File "<
https://build.barrywardell.net/job/EinsteinToolkitReleased/ws/simfactory/li…
",> line 1267, in create restartlib.CopyFileWithCaching(exe, exedir, simlib.BuildPath(self.CacheDir, 'exe')) File "<
https://build.barrywardell.net/job/EinsteinToolkitReleased/ws/simfactory/li…
",> line 628, in CopyFileWithCaching shutil.copyfile(srcfile, dstfile) File "/usr/lib/python2.7/shutil.py", line 84, in copyfile copyfileobj(fsrc, fdst) File "/usr/lib/python2.7/shutil.py", line 52, in copyfileobj fdst.write(buf) IOError: [Errno 28] No space left on device real 0m6.168s user 0m1.972s sys 0m1.856s Build step 'Execute shell' marked build as failure [WARNINGS] Skipping publisher since build result is FAILURE Recording test results ERROR: Failed to archive test reports hudson.util.IOException2: remote file operation failed: <
https://build.barrywardell.net/job/EinsteinToolkitReleased/ws/
> at hudson.remoting.Channel@42aa3910:cct at hudson.FilePath.act(FilePath.java:906) at hudson.FilePath.act(FilePath.java:883) at hudson.tasks.junit.JUnitParser.parse(JUnitParser.java:87) at hudson.tasks.junit.JUnitResultArchiver.parse(JUnitResultArchiver.java:122) at hudson.tasks.junit.JUnitResultArchiver.perform(JUnitResultArchiver.java:134) at hudson.tasks.BuildStepMonitor$1.perform(BuildStepMonitor.java:19) at hudson.model.AbstractBuild$AbstractBuildExecution.perform(AbstractBuild.java:780) at hudson.model.AbstractBuild$AbstractBuildExecution.performAllBuildSteps(AbstractBuild.java:752) at hudson.model.Build$BuildExecution.post2(Build.java:183) at hudson.model.AbstractBuild$AbstractBuildExecution.post(AbstractBuild.java:705) at hudson.model.Run.execute(Run.java:1617) at hudson.model.FreeStyleBuild.run(FreeStyleBuild.java:46) at hudson.model.ResourceController.execute(ResourceController.java:88) at hudson.model.Executor.run(Executor.java:237) Caused by: hudson.util.IOException2: Failed to read <
https://build.barrywardell.net/job/EinsteinToolkitReleased/ws/testresults.x…
> at hudson.tasks.junit.TestResult.parse(TestResult.java:291) at hudson.tasks.junit.TestResult.parsePossiblyEmpty(TestResult.java:230) at hudson.tasks.junit.TestResult.parse(TestResult.java:165) at hudson.tasks.junit.TestResult.parse(TestResult.java:148) at hudson.tasks.junit.TestResult.<init>(TestResult.java:124) at hudson.tasks.junit.JUnitParser$ParseResultCallable.invoke(JUnitParser.java:117) at hudson.tasks.junit.JUnitParser$ParseResultCallable.invoke(JUnitParser.java:90) at hudson.FilePath$FileCallableWrapper.call(FilePath.java:2394) at hudson.remoting.UserRequest.perform(UserRequest.java:118) at hudson.remoting.UserRequest.perform(UserRequest.java:48) at hudson.remoting.Request$2.run(Request.java:326) at hudson.remoting.InterceptingExecutorService$1.call(InterceptingExecutorService.java:72) at java.util.concurrent.FutureTask$Sync.innerRun(FutureTask.java:334) at java.util.concurrent.FutureTask.run(FutureTask.java:166) at java.util.concurrent.ThreadPoolExecutor.runWorker(ThreadPoolExecutor.java:1146) at java.util.concurrent.ThreadPoolExecutor$Worker.run(ThreadPoolExecutor.java:615) at java.lang.Thread.run(Thread.java:701) Caused by: org.dom4j.DocumentException: Error on line 2 of document file://<
https://build.barrywardell.net/job/EinsteinToolkitReleased/ws/testresults.x…
> : XML document structures must start and end within the same entity. Nested exception: XML document structures must start and end within the same entity. at org.dom4j.io.SAXReader.read(SAXReader.java:482) at org.dom4j.io.SAXReader.read(SAXReader.java:264) at hudson.tasks.junit.SuiteResult.parse(SuiteResult.java:129) at hudson.tasks.junit.TestResult.parse(TestResult.java:274) ... 16 more Caused by: org.xml.sax.SAXParseException; systemId: file://<
https://build.barrywardell.net/job/EinsteinToolkitReleased/ws/testresults.x…
;> lineNumber: 2; columnNumber: 1; XML document structures must start and end within the same entity. at com.sun.org.apache.xerces.internal.util.ErrorHandlerWrapper.createSAXParseException(ErrorHandlerWrapper.java:198) at com.sun.org.apache.xerces.internal.util.ErrorHandlerWrapper.fatalError(ErrorHandlerWrapper.java:177) at com.sun.org.apache.xerces.internal.impl.XMLErrorReporter.reportError(XMLErrorReporter.java:391) at com.sun.org.apache.xerces.internal.impl.XMLScanner.reportFatalError(XMLScanner.java:1452) at com.sun.org.apache.xerces.internal.impl.XMLDocumentFragmentScannerImpl.endEntity(XMLDocumentFragmentScannerImpl.java:888) at com.sun.org.apache.xerces.internal.impl.XMLDocumentScannerImpl.endEntity(XMLDocumentScannerImpl.java:582) at com.sun.org.apache.xerces.internal.impl.XMLEntityManager.endEntity(XMLEntityManager.java:1377) at com.sun.org.apache.xerces.internal.impl.XMLEntityScanner.load(XMLEntityScanner.java:1740) at com.sun.org.apache.xerces.internal.impl.XMLEntityScanner.skipChar(XMLEntityScanner.java:1393) at com.sun.org.apache.xerces.internal.impl.XMLDocumentFragmentScannerImpl$FragmentContentDriver.next(XMLDocumentFragmentScannerImpl.java:2776) at com.sun.org.apache.xerces.internal.impl.XMLDocumentScannerImpl.next(XMLDocumentScannerImpl.java:625) at com.sun.org.apache.xerces.internal.impl.XMLNSDocumentScannerImpl.next(XMLNSDocumentScannerImpl.java:117) at com.sun.org.apache.xerces.internal.impl.XMLDocumentFragmentScannerImpl.scanDocument(XMLDocumentFragmentScannerImpl.java:489) at com.sun.org.apache.xerces.internal.parsers.XML11Configuration.parse(XML11Configuration.java:828) at com.sun.org.apache.xerces.internal.parsers.XML11Configuration.parse(XML11Configuration.java:757) at com.sun.org.apache.xerces.internal.parsers.XMLParser.parse(XMLParser.java:133) at com.sun.org.apache.xerces.internal.parsers.AbstractSAXParser.parse(AbstractSAXParser.java:1211) at com.sun.org.apache.xerces.internal.jaxp.SAXParserImpl$JAXPSAXParser.parse(SAXParserImpl.java:551) at org.dom4j.io.SAXReader.read(SAXReader.java:465) ... 19 more
1
1
0
0
EinsteinToolkit - Build #988 - Still Unstable - 381/406 tests passed
by ian.hinder@aei.mpg.de
10 Jan '14
10 Jan '14
1
4
0
0
Jenkins build is back to normal : EinsteinToolkitReleased #21
by ian.hinder@aei.mpg.de
19 Dec '13
19 Dec '13
See <
https://build.barrywardell.net/job/EinsteinToolkitReleased/21/
>
1
0
0
0
EinsteinToolkit - Build #982 - Failure
by ian.hinder@aei.mpg.de
18 Dec '13
18 Dec '13
1
2
0
0
Jenkins build became unstable: EinsteinToolkitReleased #18
by ian.hinder@aei.mpg.de
17 Dec '13
17 Dec '13
See <
https://build.barrywardell.net/job/EinsteinToolkitReleased/18/changes
>
1
1
0
0
EinsteinToolkit - Build #976 - Still Unstable - 404/406 tests passed
by ian.hinder@aei.mpg.de
13 Dec '13
13 Dec '13
1
0
0
0
EinsteinToolkit - Build #970 - Still unstable - 378/388 tests passed
by ian.hinder@aei.mpg.de
10 Dec '13
10 Dec '13
1
0
0
0
EinsteinToolkit - Build #970 - Still unstable - 378/388 tests passed
by ian.hinder@aei.mpg.de
10 Dec '13
10 Dec '13
1
0
0
0
EinsteinToolkit - Test results changed
by ian.hinder@aei.mpg.de
06 Dec '13
06 Dec '13
1
1
0
0
← Newer
1
...
38
39
40
41
42
43
44
Older →
Jump to page:
1
2
3
4
5
6
7
8
9
10
11
12
13
14
15
16
17
18
19
20
21
22
23
24
25
26
27
28
29
30
31
32
33
34
35
36
37
38
39
40
41
42
43
44
Results per page:
10
25
50
100
200