BUILD FAILURE
Changes
| Revision: |
01b62d421e74def30824ed1d9902a2c002fc0e71 |
| Author: | Einstein Toolkit Git Server |
| Log: | Updated submodules:
* flesh 9adb2cf...be17a77 (2):
> Allow POSTPROC to use a global directive and check for multiple matching directives.
> Warn if warn only
|
| Revision: |
dcebe9b702f53b7ce2115d03017545ee5ff03ef3 |
| Author: | Einstein Toolkit Git Server |
| Log: | Updated submodules:
* arrangements/WVUThorns 6787a1e...c565d9c (1):
> WVUThorns: IllinoisGRMHD -- Register admbase variable groups as SaveAndRestore, so that MoL knows they are needed by IllinoisGRMHD during the evolution. Simplifies scheduling within Baikal
|
| Revision: |
7067bcbbe860420d36e244cc9f458452ca38b5df |
| Author: | Einstein Toolkit Git Server |
| Log: | Updated submodules:
* arrangements/WVUThorns c565d9c...3e47490 (1):
> WVUThorns: Baikal/BaikalVacuum -- Code review revisions: Correctly specify symmetry options for all gridfunctions; allocate 1 timelevel for needed ADMBase gridfunction groups. Remove Jupyter notebook from Baikal/doc; documentation.tex now points to latest version instead.
|
| Revision: |
5209206928330b0a684a248cc670187a6302b04c |
| Author: | Einstein Toolkit Git Server |
| Log: | Updated submodules:
* arrangements/WVUThorns 3e47490...41e0b08 (1):
> WVUThorns: Baikal+BaikalVacuum -- Code review fixes: Correct the NewRad parameters for the lapse at the outer boundary.
|
| Revision: |
133e105dac940a9e2cd73cab68d431aac24932d1 |
| Author: | Einstein Toolkit Git Server |
| Log: | Updated submodules:
* flesh be17a77...02f44db (1):
> When running postproc, collect all settings for the thorn as well as the individual test.
|
Console Output
[...truncated 68.90 KB...]
WaveToy1DF77
Implements: wavetoy1d
Inherits: boundary
0 Public, 0 Protected, 4 Private variable groups
WaveToy2DF77
Implements: wavetoy2d
Inherits: boundary
0 Public, 0 Protected, 4 Private variable groups
WaveToyC
Implements: wavetoy
Inherits: grid
1 Public, 0 Protected, 0 Private variable groups
WaveToyCXX
Implements: wavetoy
Inherits: grid
1 Public, 0 Protected, 0 Private variable groups
WaveToyExtra
Implements: wavetoyextra
Inherits: wavetoy
0 Public, 0 Protected, 0 Private variable groups
WaveToyF77
Implements: wavetoy
Inherits: grid
1 Public, 0 Protected, 0 Private variable groups
WaveToyF90
Implements: wavetoy
Inherits: grid
1 Public, 0 Protected, 0 Private variable groups
WaveToyFreeF90
Implements: wavetoy
Inherits: grid
1 Public, 0 Protected, 0 Private variable groups
WeylScal4
Implements: WeylScal4
Inherits: admbase Boundary GenericFD Grid methodoflines
18 Public, 0 Protected, 0 Private variable groups
hwloc
Implements: hwloc
0 Public, 0 Protected, 0 Private variable groups
libjpeg
Implements: libjpeg
0 Public, 0 Protected, 0 Private variable groups
particle_tracerET
Implements: particle_tracerET
Inherits: grid HydroBase ADMBase
0 Public, 0 Protected, 3 Private variable groups
pthreads
Implements: PTHREADS
0 Public, 0 Protected, 0 Private variable groups
smallbPoynET
Implements: smallbPoynET
Inherits: grid HydroBase ADMBase
0 Public, 0 Protected, 1 Private variable groups
zlib
Implements: zlib
0 Public, 0 Protected, 0 Private variable groups
Parsing parameter files...
ADMAnalysis
0 Global, 0 Restricted, 4 Private parameters
ADMBase
0 Global, 18 Restricted, 0 Private parameters
ADMCoupling
0 Global, 0 Restricted, 0 Private parameters
ADMDerivatives
0 Global, 0 Restricted, 6 Private parameters
ADMMacros
0 Global, 1 Restricted, 0 Private parameters
ADMMass
0 Global, 0 Restricted, 17 Private parameters
AEILocalInterp
0 Global, 0 Restricted, 1 Private parameters
AHFinder
0 Global, 2 Restricted, 87 Private parameters
AHFinderDirect
0 Global, 0 Restricted, 154 Private parameters
BLAS
0 Global, 0 Restricted, 0 Private parameters
Baikal
/home/jenkins/workspace/EinsteinToolkit/lib/make/make.configuration:212: recipe for target '/home/jenkins/workspace/EinsteinToolkit/configs/sim/config-data/make.thornlist' failed
make[1]: *** [/home/jenkins/workspace/EinsteinToolkit/configs/sim/config-data/make.thornlist] Error 25
Makefile:259: recipe for target 'sim' failed
make: *** [sim] Error 2
Build step 'Execute shell' marked build as failure
Archiving artifacts
Recording test results
ERROR: Step ?Publish JUnit test result report? failed: Test reports were found but none of them are new. Did leafNodes run?
For example, /home/jenkins/workspace/EinsteinToolkit/testresults.xml is 1 hr 0 min old
IRC notifier plugin: Sending notification to: #cactus
IRC notifier plugin: [ERROR] not connected. Cannot send message to '#cactus'
Started calculate disk usage of build
Finished Calculation of disk usage of build in 0 seconds
Started calculate disk usage of workspace
Finished Calculation of disk usage of workspace in 2 second
Email was triggered for: Failure - 1st
Email was triggered for: Failure - Any
Trigger Failure - Any was overridden by another trigger and will not send an email.
Trigger Failure - Still was overridden by another trigger and will not send an email.
Sending email for trigger: Failure - 1st