BUILD FAILURE
| Build URL: | https://build.barrywardell.net/job/EinsteinToolkit/1610/ |
| Project: | EinsteinToolkit |
| Date of build: | Sat, 02 May 2020 17:59:09 +0000 |
| Build duration: | 1 min 23 sec |
| Revision: | 78b50b9c84ed1c6a78f0745a49721dceaba193bb |
| Author: | Einstein Toolkit Git Server |
| Log: | Updated submodules: * arrangements/CactusTest 60bb6d9...cc2523e (7): > TestReadWrite: correct access to vectors in schedule > TestReadWrite: fix READS / WRITES to make test run > TestReadWrite: make tests using non-storage var_p_p work > TestReadWrite: set psync options in test > TestReadWrite: work towards getting regions correct > TestReadWrite: correct test for union of arguments in Test_A > TestReadWrite: enable storage for Var3 * flesh 2798e0a...3a60217 (6): > Cactus: abort if using psync and RDWR encounters invalid varnames > Cactus: force rebuild after changing where rdwr is qualified > Cactus: qualify rdwr element when creating schedule code > Cactus: adjust rdwr.pl to qname change > Cactus: do not attempt to make reads vars fully qualified in parser > Cactus: show file and line number when reporting duplicate RDWR entries |
[...truncated 166.13 KB...] CST error in /home/jenkins/workspace/EinsteinToolkit/flesh/lib/sbin/CreateScheduleBindings.pl (at 904) -> Schedule error: Thorn TOVSolver - group or variable gzz doesn't exist. CST error in /home/jenkins/workspace/EinsteinToolkit/flesh/lib/sbin/CreateScheduleBindings.pl (at 904) -> Schedule error: Thorn TOVSolver - group or variable rho doesn't exist. CST error in /home/jenkins/workspace/EinsteinToolkit/flesh/lib/sbin/CreateScheduleBindings.pl (at 904) -> Schedule error: Thorn TOVSolver - group or variable vel doesn't exist. CST error in /home/jenkins/workspace/EinsteinToolkit/flesh/lib/sbin/CreateScheduleBindings.pl (at 904) -> Schedule error: Thorn TOVSolver - group or variable w_lorentz doesn't exist. CST error in /home/jenkins/workspace/EinsteinToolkit/flesh/lib/sbin/CreateScheduleBindings.pl (at 904) -> Schedule error: Thorn TOVSolver - group or variable rho doesn't exist. CST error in /home/jenkins/workspace/EinsteinToolkit/flesh/lib/sbin/CreateScheduleBindings.pl (at 904) -> Schedule error: Thorn TOVSolver - group or variable vel doesn't exist. CST error in /home/jenkins/workspace/EinsteinToolkit/flesh/lib/sbin/CreateScheduleBindings.pl (at 904) -> Schedule error: Thorn TOVSolver - group or variable w_lorentz doesn't exist. CST error in /home/jenkins/workspace/EinsteinToolkit/flesh/lib/sbin/CreateScheduleBindings.pl (at 904) -> Schedule error: Thorn TOVSolver - group or variable rho doesn't exist. CST error in /home/jenkins/workspace/EinsteinToolkit/flesh/lib/sbin/CreateScheduleBindings.pl (at 904) -> Schedule error: Thorn TOVSolver - group or variable vel doesn't exist. CST error in /home/jenkins/workspace/EinsteinToolkit/flesh/lib/sbin/CreateScheduleBindings.pl (at 904) -> Schedule error: Thorn TOVSolver - group or variable w_lorentz doesn't exist. CST error in /home/jenkins/workspace/EinsteinToolkit/flesh/lib/sbin/CreateScheduleBindings.pl (at 904) -> Schedule error: Thorn TmunuBase - group or variable shift doesn't exist. CST error in /home/jenkins/workspace/EinsteinToolkit/flesh/lib/sbin/CreateScheduleBindings.pl (at 904) -> Schedule error: Thorn TmunuBase - group or variable metric doesn't exist. CST error in /home/jenkins/workspace/EinsteinToolkit/flesh/lib/sbin/CreateScheduleBindings.pl (at 904) -> Schedule error: Thorn TmunuBase - group or variable y doesn't exist. CST error in /home/jenkins/workspace/EinsteinToolkit/flesh/lib/sbin/CreateScheduleBindings.pl (at 904) -> Schedule error: Thorn TmunuBase - group or variable z doesn't exist. CST error in /home/jenkins/workspace/EinsteinToolkit/flesh/lib/sbin/CreateScheduleBindings.pl (at 904) -> Schedule error: Thorn TmunuBase - group or variable decoded_exact_model doesn't exist. CST error in /home/jenkins/workspace/EinsteinToolkit/flesh/lib/sbin/CreateScheduleBindings.pl (at 904) -> Schedule error: Thorn TwoPunctures - group or variable confac_2derivs doesn't exist. CST error in /home/jenkins/workspace/EinsteinToolkit/flesh/lib/sbin/CreateScheduleBindings.pl (at 904) -> Schedule error: Thorn TwoPunctures - group or variable confac_1derivs doesn't exist. CST error in /home/jenkins/workspace/EinsteinToolkit/flesh/lib/sbin/CreateScheduleBindings.pl (at 904) -> Schedule error: Thorn TwoPunctures - group or variable confac doesn't exist. CST error in /home/jenkins/workspace/EinsteinToolkit/flesh/lib/sbin/CreateScheduleBindings.pl (at 904) -> Schedule error: Thorn TwoPunctures - group or variable metric doesn't exist. CST error in /home/jenkins/workspace/EinsteinToolkit/flesh/lib/sbin/CreateScheduleBindings.pl (at 904) -> Schedule error: Thorn TwoPunctures - group or variable curv doesn't exist. ------------------------------------------------------ /home/jenkins/workspace/EinsteinToolkit/lib/make/make.configuration:212: recipe for target '/home/jenkins/workspace/EinsteinToolkit/configs/sim/config-data/make.thornlist' failed make[1]: *** [/home/jenkins/workspace/EinsteinToolkit/configs/sim/config-data/make.thornlist] Error 1 Makefile:259: recipe for target 'sim' failed make: *** [sim] Error 2 Build step 'Execute shell' marked build as failure Archiving artifacts Recording test results ERROR: Step ?Publish JUnit test result report? failed: Test reports were found but none of them are new. Did leafNodes run? For example, /home/jenkins/workspace/EinsteinToolkit/testresults.xml is 2 days 0 hr old IRC notifier plugin: Sending notification to: #cactus IRC notifier plugin: [ERROR] not connected. Cannot send message to '#cactus' Started calculate disk usage of build Finished Calculation of disk usage of build in 0 seconds Started calculate disk usage of workspace Finished Calculation of disk usage of workspace in 2 second Email was triggered for: Failure - Any Sending email for trigger: Failure - Any