BUILD FAILURE
Changes
| Revision: |
bcb38a46359a8908ddd7d0a44f81e01905bd494e |
| Author: | Einstein Toolkit Git Server |
| Log: | Updated submodules:
* flesh b7cf315...751fa10 (5):
> Cactus: make piraha's ccl cache location a global variable
> Cactus: move parse_ccl helper into CSTUtils.pl
> Cactus: set up parser type in LaTeX parsers
> Cactus: check for invalid parser type in CCL parsers
> Cactus: correct extracting thorn name in GetThornPaths
|
Tests
Artifacts
Console Output
[...truncated 972.88 KB...]
Creating hdf5_slicer in /home/jenkins/workspace/EinsteinToolkit/exe/sim from /home/jenkins/workspace/EinsteinToolkit/configs/sim/build/CarpetIOHDF5/hdf5_slicer.o
Creating hdf5_recombiner in /home/jenkins/workspace/EinsteinToolkit/exe/sim from /home/jenkins/workspace/EinsteinToolkit/configs/sim/build/CarpetIOHDF5/hdf5_recombiner.o
Compiling /home/jenkins/workspace/EinsteinToolkit/configs/sim/build/GRHydro/Riemann1d-main.c
Creating hdf5_merge in /home/jenkins/workspace/EinsteinToolkit/exe/sim from /home/jenkins/workspace/EinsteinToolkit/configs/sim/build/HDF5/hdf5_merge.o
Creating hdf5_extract in /home/jenkins/workspace/EinsteinToolkit/exe/sim from /home/jenkins/workspace/EinsteinToolkit/configs/sim/build/HDF5/hdf5_extract.o
Creating hdf5_double_to_single in /home/jenkins/workspace/EinsteinToolkit/exe/sim from /home/jenkins/workspace/EinsteinToolkit/configs/sim/build/HDF5/hdf5_double_to_single.o
Creating RNS in /home/jenkins/workspace/EinsteinToolkit/exe/sim from /home/jenkins/workspace/EinsteinToolkit/configs/sim/build/Hydro_RNSID/RNS.o
Creating RNS_readID in /home/jenkins/workspace/EinsteinToolkit/exe/sim from /home/jenkins/workspace/EinsteinToolkit/configs/sim/build/Hydro_RNSID/RNS_readID.o
Creating hdf5_convert_from_carpetiohdf5 in /home/jenkins/workspace/EinsteinToolkit/exe/sim from /home/jenkins/workspace/EinsteinToolkit/configs/sim/build/IOHDF5/hdf5_convert_from_carpetiohdf5.o
Compiling /home/jenkins/workspace/EinsteinToolkit/arrangements/PITTNullCode/SphericalHarmonicRecon/src/util/ascii_output.c
Compiling /home/jenkins/workspace/EinsteinToolkit/arrangements/PITTNullCode/SphericalHarmonicRecon/src/util/fftwfilter.c
Compiling /home/jenkins/workspace/EinsteinToolkit/arrangements/PITTNullCode/SphericalHarmonicRecon/src/util/setmeta.c
Compiling /home/jenkins/workspace/EinsteinToolkit/arrangements/PITTNullCode/SphericalHarmonicRecon/src/util/findlast.c
Compiling /home/jenkins/workspace/EinsteinToolkit/arrangements/PITTNullCode/SphericalHarmonicRecon/src/util/printtime.c
Compiling /home/jenkins/workspace/EinsteinToolkit/arrangements/PITTNullCode/SphericalHarmonicRecon/src/util/readmeta.c
Creating Riemann1d in /home/jenkins/workspace/EinsteinToolkit/exe/sim from /home/jenkins/workspace/EinsteinToolkit/configs/sim/build/GRHydro/Riemann1d.o
Creating ascii_output in /home/jenkins/workspace/EinsteinToolkit/exe/sim from /home/jenkins/workspace/EinsteinToolkit/configs/sim/build/SphericalHarmonicRecon/ascii_output.o
Creating fftwfilter in /home/jenkins/workspace/EinsteinToolkit/exe/sim from /home/jenkins/workspace/EinsteinToolkit/configs/sim/build/SphericalHarmonicRecon/fftwfilter.o
Creating setmeta in /home/jenkins/workspace/EinsteinToolkit/exe/sim from /home/jenkins/workspace/EinsteinToolkit/configs/sim/build/SphericalHarmonicRecon/setmeta.o
Creating findlast in /home/jenkins/workspace/EinsteinToolkit/exe/sim from /home/jenkins/workspace/EinsteinToolkit/configs/sim/build/SphericalHarmonicRecon/findlast.o
Creating printtime in /home/jenkins/workspace/EinsteinToolkit/exe/sim from /home/jenkins/workspace/EinsteinToolkit/configs/sim/build/SphericalHarmonicRecon/printtime.o
Creating readmeta in /home/jenkins/workspace/EinsteinToolkit/exe/sim from /home/jenkins/workspace/EinsteinToolkit/configs/sim/build/SphericalHarmonicRecon/readmeta.o
Done.
real 31m28.674s
user 49m9.928s
sys 3m36.528s
real 31m30.951s
user 49m11.136s
sys 3m36.732s
Skeleton Created
Job directory: "/home/jenkins/simulations/EinsteinToolkit_bcb38a46359a8908ddd7d0a44f81e01905bd494e_1"
Option --testsuite given
Executable: "/home/jenkins/workspace/EinsteinToolkit/exe/cactus_sim"
Option list: "/home/jenkins/simulations/EinsteinToolkit_bcb38a46359a8908ddd7d0a44f81e01905bd494e_1/SIMFACTORY/cfg/OptionList"
Submit script: "/home/jenkins/simulations/EinsteinToolkit_bcb38a46359a8908ddd7d0a44f81e01905bd494e_1/SIMFACTORY/run/SubmitScript"
Run script: "/home/jenkins/simulations/EinsteinToolkit_bcb38a46359a8908ddd7d0a44f81e01905bd494e_1/SIMFACTORY/run/RunScript"
Simulation name: EinsteinToolkit_bcb38a46359a8908ddd7d0a44f81e01905bd494e_1
Assigned restart id: 0
Copying testsuite data
Running simulation EinsteinToolkit_bcb38a46359a8908ddd7d0a44f81e01905bd494e_1
Running test suite sim-testsuite
String found where operator expected at /home/jenkins/simulations/EinsteinToolkit_bcb38a46359a8908ddd7d0a44f81e01905bd494e_1/output-0000/lib/sbin/CSTUtils.pl line 937, near "croak "bad ccl file '$ccl_file'""
(Do you need to predeclare croak?)
syntax error at /home/jenkins/simulations/EinsteinToolkit_bcb38a46359a8908ddd7d0a44f81e01905bd494e_1/output-0000/lib/sbin/CSTUtils.pl line 937, near "croak "bad ccl file '$ccl_file'""
Compilation failed in require at lib/sbin/RunTestUtils.pl line 17.
Compilation failed in require at lib/sbin/RunTest.pl line 28.
Makefile:912: recipe for target 'sim-testsuite' failed
make: *** [sim-testsuite] Error 255
Wed Nov 13 22:28:50 UTC 2019
Simfactory Done at date: 0
Skeleton Created
Job directory: "/home/jenkins/simulations/EinsteinToolkit_bcb38a46359a8908ddd7d0a44f81e01905bd494e_2"
Option --testsuite given
Executable: "/home/jenkins/workspace/EinsteinToolkit/exe/cactus_sim"
Option list: "/home/jenkins/simulations/EinsteinToolkit_bcb38a46359a8908ddd7d0a44f81e01905bd494e_2/SIMFACTORY/cfg/OptionList"
Submit script: "/home/jenkins/simulations/EinsteinToolkit_bcb38a46359a8908ddd7d0a44f81e01905bd494e_2/SIMFACTORY/run/SubmitScript"
Run script: "/home/jenkins/simulations/EinsteinToolkit_bcb38a46359a8908ddd7d0a44f81e01905bd494e_2/SIMFACTORY/run/RunScript"
Simulation name: EinsteinToolkit_bcb38a46359a8908ddd7d0a44f81e01905bd494e_2
Assigned restart id: 0
Copying testsuite data
Running simulation EinsteinToolkit_bcb38a46359a8908ddd7d0a44f81e01905bd494e_2
Running test suite sim-testsuite
String found where operator expected at /home/jenkins/simulations/EinsteinToolkit_bcb38a46359a8908ddd7d0a44f81e01905bd494e_2/output-0000/lib/sbin/CSTUtils.pl line 937, near "croak "bad ccl file '$ccl_file'""
(Do you need to predeclare croak?)
syntax error at /home/jenkins/simulations/EinsteinToolkit_bcb38a46359a8908ddd7d0a44f81e01905bd494e_2/output-0000/lib/sbin/CSTUtils.pl line 937, near "croak "bad ccl file '$ccl_file'""
Compilation failed in require at lib/sbin/RunTestUtils.pl line 17.
Compilation failed in require at lib/sbin/RunTest.pl line 28.
Makefile:912: recipe for target 'sim-testsuite' failed
make: *** [sim-testsuite] Error 255
Wed Nov 13 22:28:52 UTC 2019
Simfactory Done at date: 0
No such file /home/jenkins/simulations/EinsteinToolkit_bcb38a46359a8908ddd7d0a44f81e01905bd494e_1/output-0000/TEST/sim/summary.log; aborting
cat: /home/jenkins/simulations/EinsteinToolkit_bcb38a46359a8908ddd7d0a44f81e01905bd494e_1/output-0000/EinsteinToolkit_bcb38a46359a8908ddd7d0a44f81e01905bd494e_1.out: No such file or directory
Build step 'Execute shell' marked build as failure
Archiving artifacts
Recording test results
IRC notifier plugin: Sending notification to: #cactus
IRC notifier plugin: [ERROR] not connected. Cannot send message to '#cactus'
Started calculate disk usage of build
Finished Calculation of disk usage of build in 0 seconds
Started calculate disk usage of workspace
Finished Calculation of disk usage of workspace in 7 second
Email was triggered for: Failure - 1st
Email was triggered for: Test Regression
Email was triggered for: Test Improvement
Email was triggered for: Failure - Any
Trigger Unstable (Test Failures) was overridden by another trigger and will not send an email.
Trigger Unstable (Test Failures) - Still was overridden by another trigger and will not send an email.
Trigger Failure - Any was overridden by another trigger and will not send an email.
Trigger Failure - Still was overridden by another trigger and will not send an email.
Trigger Unstable (Test Failures) was overridden by another trigger and will not send an email.
Trigger Unstable (Test Failures) - Still was overridden by another trigger and will not send an email.
Sending email for trigger: Test Regression
Sending email to: test@einsteintoolkit.org
Sending email for trigger: Failure - 1st
Sending email to: test@einsteintoolkit.org
Sending email for trigger: Test Improvement