BUILD FAILURE
Changes
| Revision: |
0c23b3f163637bad2f96903ee5ebb14d03d758d0 |
| Author: | Einstein Toolkit Git Server |
| Log: | Updated submodules:
* flesh 9277b85...2798e0a (1):
> Make specification of implementation for reads/writes variables and groups optional.
|
Console Output
[...truncated 458.33 KB...]
/home/jenkins/workspace/EinsteinToolkit/configs/sim/build/TestLocalReduce/Reduce_Sum.c:66:12: warning: variable 'input_array_dims1D' set but not used [-Wunused-but-set-variable]
CCTK_INT input_array_dims1D[1];
^
/home/jenkins/workspace/EinsteinToolkit/configs/sim/build/TestLocalReduce/Reduce_Sum.c:65:12: warning: variable 'input_array_dims2D' set but not used [-Wunused-but-set-variable]
CCTK_INT input_array_dims2D[2];
^
/home/jenkins/workspace/EinsteinToolkit/configs/sim/build/TestLocalReduce/Reduce_Sum.c:48:14: warning: variable 'ierr' set but not used [-Wunused-but-set-variable]
int handle,ierr;
^
COMPILING CactusNumerical/TestLocalReduce/src/Reduce_Avg.c
/home/jenkins/workspace/EinsteinToolkit/configs/sim/build/TestLocalReduce/Reduce_Avg.c: In function 'TestLocalReduceC_Avg':
/home/jenkins/workspace/EinsteinToolkit/configs/sim/build/TestLocalReduce/Reduce_Avg.c:67:12: warning: variable 'input_array_dims1D' set but not used [-Wunused-but-set-variable]
CCTK_INT input_array_dims1D[1];
^
/home/jenkins/workspace/EinsteinToolkit/configs/sim/build/TestLocalReduce/Reduce_Avg.c:66:12: warning: variable 'input_array_dims2D' set but not used [-Wunused-but-set-variable]
CCTK_INT input_array_dims2D[2];
^
/home/jenkins/workspace/EinsteinToolkit/configs/sim/build/TestLocalReduce/Reduce_Avg.c:48:14: warning: variable 'ierr' set but not used [-Wunused-but-set-variable]
int handle,ierr;
^
COMPILING configs/sim/bindings/build/TestLocalReduce/cctk_ThornBindings.c
Updating /home/jenkins/workspace/EinsteinToolkit/configs/sim/lib/libthorn_TestLocalReduce.a
Checking status of thorn TestLoop
Updating /home/jenkins/workspace/EinsteinToolkit/configs/sim/lib/libthorn_TestLocalInterp2.a
Checking status of thorn TestMath
COMPILING CactusTest/TestLoop/src/TestLoopPointwise.c
COMPILING CactusTest/TestMath/src/math_c.c
COMPILING CactusTest/TestMath/src/math_cc.cc
COMPILING CactusTest/TestLoop/src/TestLoopC.c
COMPILING CactusTest/TestLoop/src/TestLoopFortran.F90
COMPILING configs/sim/bindings/build/TestMath/cctk_ThornBindings.c
Updating /home/jenkins/workspace/EinsteinToolkit/configs/sim/lib/libthorn_TestMath.a
Checking status of thorn TestMoL
COMPILING configs/sim/bindings/build/TestLoop/cctk_ThornBindings.c
Updating /home/jenkins/workspace/EinsteinToolkit/configs/sim/lib/libthorn_TestLoop.a
Checking status of thorn TestPar
COMPILING CactusTest/TestMoL/src/Register.c
COMPILING CactusTest/TestPar/src/PrintStrings.c
COMPILING CactusTest/TestMoL/src/RHS.c
COMPILING CactusTest/TestPar/src/SetValues.c
COMPILING configs/sim/bindings/build/TestPar/cctk_ThornBindings.c
Updating /home/jenkins/workspace/EinsteinToolkit/configs/sim/lib/libthorn_TestPar.a
COMPILING configs/sim/bindings/build/TestMoL/cctk_ThornBindings.c
Checking status of thorn TestReadWrite
COMPILING CactusTest/TestMoL/src/Init.c
Updating /home/jenkins/workspace/EinsteinToolkit/configs/sim/lib/libthorn_TestMoL.a
Checking status of thorn TestReduce
COMPILING CactusTest/TestReadWrite/src/TestC.cc
COMPILING CactusTest/TestReduce/src/Reduce_Maximum.c
COMPILING CactusTest/TestReduce/src/Reduce_Sum.c
COMPILING CactusTest/TestReduce/src/Reduce_Maximum.F77
/home/jenkins/workspace/EinsteinToolkit/configs/sim/build/TestReadWrite/TestC.cc: In function 'void TestReadWrite_TestC_C(cGH*)':
/home/jenkins/workspace/EinsteinToolkit/configs/sim/build/TestReadWrite/TestC.cc:62:96: error: expected ',' before ')' token
static_assert(!std::is_const<std::remove_reference<decltype(*VarCurrentLevelC)>::type>::value);
^
/home/jenkins/workspace/EinsteinToolkit/configs/sim/build/TestReadWrite/TestC.cc:62:96: error: expected string-literal before ')' token
/home/jenkins/workspace/EinsteinToolkit/configs/sim/build/TestReadWrite/TestC.cc:64:83: error: expected ',' before ')' token
static_assert(std::is_const<std::remove_reference<decltype(*Var1)>::type>::value);
^
/home/jenkins/workspace/EinsteinToolkit/configs/sim/build/TestReadWrite/TestC.cc:64:83: error: expected string-literal before ')' token
/home/jenkins/workspace/EinsteinToolkit/configs/sim/build/TestReadWrite/TestC.cc:65:85: error: expected ',' before ')' token
static_assert(std::is_const<std::remove_reference<decltype(*Var1_p)>::type>::value);
^
/home/jenkins/workspace/EinsteinToolkit/configs/sim/build/TestReadWrite/TestC.cc:65:85: error: expected string-literal before ')' token
/home/jenkins/workspace/EinsteinToolkit/configs/sim/build/TestReadWrite/TestC.cc:67:88: error: expected ',' before ')' token
std::is_const<std::remove_reference<decltype(*groupVar2)>::type>::value);
^
/home/jenkins/workspace/EinsteinToolkit/configs/sim/build/TestReadWrite/TestC.cc:67:88: error: expected string-literal before ')' token
/home/jenkins/workspace/EinsteinToolkit/configs/sim/build/TestReadWrite/TestC.cc:69:92: error: expected ',' before ')' token
std::is_const<std::remove_reference<decltype(*groupVar2_p_p)>::type>::value);
^
/home/jenkins/workspace/EinsteinToolkit/configs/sim/build/TestReadWrite/TestC.cc:69:92: error: expected string-literal before ')' token
/home/jenkins/workspace/EinsteinToolkit/configs/sim/config-data/make.config.rules:278: recipe for target 'TestC.cc.o' failed
make[3]: *** [TestC.cc.o] Error 1
/home/jenkins/workspace/EinsteinToolkit/lib/make/make.thornlib:112: recipe for target 'make.checked' failed
make[2]: *** [make.checked] Error 2
/home/jenkins/workspace/EinsteinToolkit/lib/make/make.configuration:179: recipe for target '/home/jenkins/workspace/EinsteinToolkit/configs/sim/lib/libthorn_TestReadWrite.a' failed
make[1]: *** [/home/jenkins/workspace/EinsteinToolkit/configs/sim/lib/libthorn_TestReadWrite.a] Error 2
make[1]: *** Waiting for unfinished jobs....
COMPILING CactusTest/TestReduce/src/Reduce_Sum.F77
COMPILING configs/sim/bindings/build/TestReduce/cctk_ThornBindings.c
COMPILING CactusTest/TestReduce/src/Initial.c
Updating /home/jenkins/workspace/EinsteinToolkit/configs/sim/lib/libthorn_TestReduce.a
Makefile:259: recipe for target 'sim' failed
make: *** [sim] Error 2
Build step 'Execute shell' marked build as failure
Archiving artifacts
Recording test results
ERROR: Step ?Publish JUnit test result report? failed: Test reports were found but none of them are new. Did leafNodes run?
For example, /home/jenkins/workspace/EinsteinToolkit/testresults.xml is 1 day 4 hr old
IRC notifier plugin: Sending notification to: #cactus
IRC notifier plugin: [ERROR] not connected. Cannot send message to '#cactus'
Started calculate disk usage of build
Finished Calculation of disk usage of build in 0 seconds
Started calculate disk usage of workspace
Finished Calculation of disk usage of workspace in 1 second
Email was triggered for: Failure - Any
Sending email for trigger: Failure - Any