BUILD FAILURE
Changes
| Revision: |
bea967e47b8a798c1760d4cc43b594f3abb3a021 |
| Author: | Roland Haas |
| Log: | Updated submodules
|
Console Output
[...truncated 97.91 KB...]
1 schedule blocks.
TimerReport
3 schedule blocks.
Timers
2 schedule blocks.
TmunuBase
7 schedule blocks.
Trigger
3 schedule blocks.
TwoPunctures
5 schedule blocks.
TwoPunctures_KerrProca
5 schedule blocks.
Vaidya2
10 schedule blocks.
Vectors
2 schedule blocks.
VolumeIntegrals_GRMHD
10 schedule blocks.
VolumeIntegrals_vacuum
10 schedule blocks.
WatchDog
1 schedule blocks.
WaveBinarySource
1 schedule blocks.
WaveExtractL
17 schedule blocks.
WaveMoL
9 schedule blocks.
WaveToy1DF77
6 schedule blocks.
WaveToy2DF77
6 schedule blocks.
WaveToyC
11 schedule blocks.
WaveToyCXX
11 schedule blocks.
WaveToyExtra
3 schedule blocks.
WaveToyF77
11 schedule blocks.
WaveToyF90
11 schedule blocks.
WaveToyFreeF90
7 schedule blocks.
WeylScal4
48 schedule blocks.
hwloc
2 schedule blocks.
libjpeg
0 schedule blocks.
particle_tracerET
7 schedule blocks.
pthreads
0 schedule blocks.
smallbPoynET
1 schedule blocks.
zlib
0 schedule blocks.
------------------------------------------------------
There was 1 error during execution of the CST
This must be corrected before compilation can proceed
------------------------------------------------------
------------------------------------------------------
Warnings were generated during execution of the CST
------------------------------------------------------
CST error in /home/jenkins/workspace/EinsteinToolkit/lib/sbin/CST (at 323)
-> Missing thorn EinsteinInitialData/ReadInterpolate
------------------------------------------------------
/home/jenkins/workspace/EinsteinToolkit/lib/make/make.configuration:212: recipe for target '/home/jenkins/workspace/EinsteinToolkit/configs/sim/config-data/make.thornlist' failed
make[1]: *** [/home/jenkins/workspace/EinsteinToolkit/configs/sim/config-data/make.thornlist] Error 1
Makefile:260: recipe for target 'sim' failed
make: *** [sim] Error 2
Build step 'Execute shell' marked build as failure
Archiving artifacts
Recording test results
ERROR: Step ?Publish JUnit test result report? failed: Test reports were found but none of them are new. Did leafNodes run?
For example, /home/jenkins/workspace/EinsteinToolkit/testresults.xml is 12 hr old
IRC notifier plugin: Sending notification to: #cactus
IRC notifier plugin: [ERROR] not connected. Cannot send message to '#cactus'
Started calculate disk usage of build
Finished Calculation of disk usage of build in 0 seconds
Started calculate disk usage of workspace
Finished Calculation of disk usage of workspace in 2 second
Email was triggered for: Failure - 1st
Email was triggered for: Failure - Any
Trigger Failure - Any was overridden by another trigger and will not send an email.
Trigger Failure - Still was overridden by another trigger and will not send an email.
Sending email for trigger: Failure - 1st