BUILD FAILURE

Build URL:https://build.barrywardell.net/job/EinsteinToolkit/791/
Project:EinsteinToolkit
Date of build:Sun, 29 May 2016 20:13:05 +0000
Build duration:18 min

Changes

No changes


Console Output


	[...truncated 17295 lines...]

	COMPILING arrangements/EinsteinEvolve/GRHydro/src/GRHydro_HLLC.F90

	COMPILING arrangements/EinsteinEvolve/GRHydro/src/GRHydro_PPM.F90

	/home/jenkins/workspace/EinsteinToolkit/arrangements/EinsteinEvolve/GRHydro/src/GRHydro_PPM.F90:57.10:

	

	nx,dx,rho,velx,vely,velz,eps,press,rhominus,&

	1

	Warning: Unused dummy argument 'dx' at (1)

	/home/jenkins/workspace/EinsteinToolkit/arrangements/EinsteinEvolve/GRHydro/src/GRHydro_PPM.F90:1016.10:

	

	nx,dx,velx,temperature,press,&

	1

	Warning: Unused dummy argument 'dx' at (1)

	/home/jenkins/workspace/EinsteinToolkit/arrangements/EinsteinEvolve/GRHydro/src/GRHydro_PPM.F90:1533.49:

	

	subroutine SimplePPM_tracer_1d(apply_enhanced_ppm,&

	1

	Warning: Unused dummy argument 'apply_enhanced_ppm' at (1)

	/home/jenkins/workspace/EinsteinToolkit/arrangements/EinsteinEvolve/GRHydro/src/GRHydro_PPM.F90:1534.10:

	

	nx,dx,rho,velx,vely,velz, &

	1

	Warning: Unused dummy argument 'dx' at (1)

	/home/jenkins/workspace/EinsteinToolkit/arrangements/EinsteinEvolve/GRHydro/src/GRHydro_PPM.F90:1534.14:

	

	nx,dx,rho,velx,vely,velz, &

	1

	Warning: Unused dummy argument 'rho' at (1)

	/home/jenkins/workspace/EinsteinToolkit/arrangements/EinsteinEvolve/GRHydro/src/GRHydro_PPM.F90:1534.24:

	

	nx,dx,rho,velx,vely,velz, &

	1

	Warning: Unused dummy argument 'vely' at (1)

	/home/jenkins/workspace/EinsteinToolkit/arrangements/EinsteinEvolve/GRHydro/src/GRHydro_PPM.F90:1534.29:

	

	nx,dx,rho,velx,vely,velz, &

	1

	Warning: Unused dummy argument 'velz' at (1)

	/home/jenkins/workspace/EinsteinToolkit/arrangements/EinsteinEvolve/GRHydro/src/GRHydro_PPM.F90:1752.10:

	

	nx,dx,rho,velx,vely,velz, &

	1

	Warning: Unused dummy argument 'dx' at (1)

	/home/jenkins/workspace/EinsteinToolkit/arrangements/EinsteinEvolve/GRHydro/src/GRHydro_PPM.F90:1752.14:

	

	nx,dx,rho,velx,vely,velz, &

	1

	Warning: Unused dummy argument 'rho' at (1)

	/home/jenkins/workspace/EinsteinToolkit/arrangements/EinsteinEvolve/GRHydro/src/GRHydro_PPM.F90:1752.24:

	

	nx,dx,rho,velx,vely,velz, &

	1

	Warning: Unused dummy argument 'vely' at (1)

	/home/jenkins/workspace/EinsteinToolkit/arrangements/EinsteinEvolve/GRHydro/src/GRHydro_PPM.F90:1752.29:

	

	nx,dx,rho,velx,vely,velz, &

	1

	Warning: Unused dummy argument 'velz' at (1)

	COMPILING arrangements/EinsteinEvolve/GRHydro/src/GRHydro_RoeSolver.F90

	COMPILING arrangements/EinsteinEvolve/GRHydro/src/GRHydro_Con2PrimM.F90

	COMPILING arrangements/EinsteinEvolve/GRHydro/src/GRHydro_WENOReconstruct.F90

	/home/jenkins/workspace/EinsteinToolkit/arrangements/EinsteinEvolve/GRHydro/src/GRHydro_WENOReconstruct.F90:183.42:

	

	subroutine GRHydro_WENOReconstruct1d(order, nx, v, vminus, vplus, trivial_rp, &

	1

	Warning: Unused dummy argument 'order' at (1)

	Creating /home/jenkins/workspace/EinsteinToolkit/configs/sim/lib/libthorn_GRHydro.a

	Formaline: Creating configuration git repository...

	Formaline: Updating files in git repository...

	Creating Formaline tarball for thorn GRHydro

	________________________________________________________________________

	Creating cactus_sim in /home/jenkins/workspace/EinsteinToolkit/exe from EinsteinAnalysis/ADMAnalysis EinsteinBase/ADMBase EinsteinBase/ADMCoupling EinsteinBase/ADMMacros EinsteinAnalysis/ADMMass Numerical/AEILocalInterp EinsteinAnalysis/AHFinder EinsteinAnalysis/AHFinderDirect ExternalLibraries/BLAS CactusBase/Boundary CTThorns/CT_Analytic CTThorns/CT_MultiLevel EinsteinAnalysis/CalcK Carpet/Carpet Carpet/CarpetEvolutionMask Carpet/CarpetIOASCII Carpet/CarpetIOBasic Carpet/CarpetIOHDF5 Carpet/CarpetIOScalar Carpet/CarpetIntegrateTest Carpet/CarpetInterp Carpet/CarpetInterp2 Carpet/CarpetLib Carpet/CarpetMask Carpet/CarpetProlongateTest Carpet/CarpetReduce Carpet/CarpetRegrid Carpet/CarpetRegrid2 Carpet/CarpetRegridTest Carpet/CarpetSlab Carpet/CarpetTracker CactusBase/CartGrid3D CactusNumerical/Cartoon2D EinsteinBase/Constants WVUThorns/Convert_to_HydroBase CactusBase/CoordBase EinsteinBase/CoordGauge Carpet/CycleClock CactusExamples/DemoInterp CactusNumerical/Dissipation EinsteinInitialData/DistortedBHIVP EinsteinAnalysis/EHFinder EinsteinBase/EOS_Base EinsteinEOS/EOS_Hybrid EinsteinEOS/EOS_IdealFluid EinsteinEOS/EOS_Omni EinsteinEOS/EOS_Polytrope EinsteinExact/EinsteinExact_Test CactusElliptic/EllBase CactusElliptic/EllPETSc CactusElliptic/EllSOR EinsteinInitialData/Exact EinsteinAnalysis/Extract ExternalLibraries/FFTW3 CactusExamples/FleshInfo CactusUtils/Formaline CactusBase/Fortran EinsteinEvolve/GRHydro EinsteinEvolve/GRHydro_InitData ExternalLibraries/GSL EinsteinExact/GaugeWave KrancNumericalTools/GenericFD ExternalLibraries/HDF5 CactusConnect/HTTPD CactusConnect/HTTPDExtra CactusExamples/HelloWorld Carpet/HighOrderWaveTest EinsteinBase/HydroBase EinsteinAnalysis/Hydro_Analysis EinsteinInitialData/Hydro_InitExcision EinsteinInitialData/IDAnalyticBH EinsteinInitialData/IDAxiBrillBH EinsteinInitialData/IDAxiOddBrillBH EinsteinInitialData/IDBrillData EinsteinInitialData/IDConstraintViolate EinsteinInitialData/IDFileADM EinsteinInitialData/IDLinearWaves CactusWave/IDScalarWave CactusWave/IDScalarWaveC CactusWave/IDScalarWaveCXX CactusWave/IDScalarWaveElliptic CactusExamples/IDWaveMoL WVUThorns/ID_converter_ILGRMHD CactusBase/IOASCII CactusBase/IOBasic CactusPUGHIO/IOHDF5 CactusPUGHIO/IOHDF5Util CactusIO/IOJpeg CactusBase/IOUtil WVUThorns/IllinoisGRMHD CactusBase/InitBase CactusNumerical/InterpToArray EinsteinExact/KerrSchild ExternalLibraries/LAPACK ExternalLibraries/LORENE CactusNumerical/LocalInterp CactusNumerical/LocalInterp2 CactusNumerical/LocalReduce Carpet/LoopControl McLachlan/ML_ADMConstraints McLachlan/ML_ADMQuantities McLachlan/ML_BSSN McLachlan/ML_BSSN_Helper McLachlan/ML_BSSN_Test McLachlan/ML_CCZ4 McLachlan/ML_CCZ4_Helper McLachlan/ML_CCZ4_Test McLachlan/ML_WaveToy McLachlan/ML_WaveToy_Test ExternalLibraries/MPI CactusUtils/MemSpeed EinsteinInitialData/Meudon_Bin_BH EinsteinInitialData/Meudon_Bin_NS EinsteinInitialData/Meudon_Mag_NS EinsteinExact/Minkowski CactusNumerical/MoL EinsteinExact/ModifiedSchwarzschildBL EinsteinAnalysis/Multipole CactusUtils/NaNCatcher CactusUtils/NaNChecker EinsteinEvolve/NewRad CactusUtils/Nice EinsteinInitialData/NoExcision CactusUtils/NoMPI CactusNumerical/Noise CactusNumerical/Norms PITTNullCode/NullConstr PITTNullCode/NullDecomp PITTNullCode/NullEvolve PITTNullCode/NullExact PITTNullCode/NullGrid PITTNullCode/NullInterp PITTNullCode/NullNews PITTNullCode/NullPsiInt PITTNullCode/NullSHRExtract PITTNullCode/NullVars ExternalLibraries/OpenSSL EinsteinAnalysis/Outflow ExternalLibraries/PAPI ExternalLibraries/PETSc CactusPUGH/PUGH CactusPUGH/PUGHInterp CactusPUGH/PUGHReduce CactusPUGH/PUGHSlab CactusNumerical/Periodic Carpet/PeriodicCarpet CactusExamples/Poisson EinsteinAnalysis/PunctureTracker EinsteinAnalysis/QuasiLocalMeasures Carpet/ReductionTest Carpet/ReductionTest2 Carpet/ReductionTest3 CactusNumerical/ReflectionSymmetry Carpet/RegridSyncTest EinsteinInitialData/RotatingDBHIVP CactusNumerical/RotatingSymmetry180 CactusNumerical/RotatingSymmetry90 CactusExamples/SampleBoundary CactusExamples/SampleIO WVUThorns/Seed_Magnetic_Fields EinsteinUtils/SetMask_SphericalSurface EinsteinExact/ShiftedGaugeWave CactusNumerical/Slab CactusNumerical/SlabTest CactusConnect/Socket CactusNumerical/SpaceMask PITTNullCode/SphericalHarmonicDecomp PITTNullCode/SphericalHarmonicRecon PITTNullCode/SphericalHarmonicReconGen CactusNumerical/SphericalSurface EinsteinBase/StaticConformal CactusNumerical/SummationByParts CactusBase/SymBase CactusUtils/SystemStatistics CactusUtils/SystemTopology CactusElliptic/TATelliptic EinsteinUtils/TGRtensor EinsteinInitialData/TOVSolver CactusUtils/TerminationTrigger CactusTest/TestArrays Carpet/TestCarpetGridInfo CactusTest/TestComplex CactusTest/TestCoordinates CactusTest/TestFortranCrayPointers CactusTest/TestFortranDependencies1 CactusTest/TestFortranDependencies2 CactusTest/TestFpointerNULL CactusTest/TestFreeF90 CactusTest/TestGlobalReduce CactusTest/TestInclude1 CactusTest/TestInclude2 CactusNumerical/TestLocalInterp2 CactusNumerical/TestLocalReduce CactusTest/TestLoop Carpet/TestLoopControl CactusTest/TestMath CactusTest/TestMoL CactusTest/TestPar CactusTest/TestReduce CactusTest/TestSchedule CactusTest/TestStrings CactusTest/TestTable CactusTest/TestTimers CactusTest/TestTypes CactusBase/Time CactusExamples/TimerInfo CactusUtils/TimerReport Carpet/Timers EinsteinBase/TmunuBase CactusUtils/Trigger EinsteinInitialData/TwoPunctures EinsteinExact/Vaidya2 CactusUtils/Vectors CactusUtils/WatchDog CactusWave/WaveBinarySource CactusExamples/WaveMoL CactusExamples/WaveToy1DF77 CactusExamples/WaveToy2DF77 CactusWave/WaveToyC CactusWave/WaveToyCXX CactusWave/WaveToyExtra CactusWave/WaveToyF77 CactusWave/WaveToyF90 CactusWave/WaveToyFreeF90 EinsteinAnalysis/WeylScal4 ExternalLibraries/hwloc ExternalLibraries/libjpeg ExternalLibraries/pthreads ExternalLibraries/zlib

	fatal: bad revision 'HEAD'

	Formaline: Committing source tree to git repository...

	Formaline: Created git tag build-sim-caltechcactusjenkins.spdns.org-jenkins-2016.05.29-20.20.21-10875

	Formaline: Updated git branch config-sim-caltechcactusjenkins.spdns.org-home-jenkins-workspace-EinsteinToolkit

	Formaline: Optimising git repository (slow only the first time)...

	Done creating cactus_sim.

	Formaline: Pushing to master git repository...

	Formaline: ERROR during: Pushing to master git repository

	Command was: /usr/bin/git --git-dir='/home/jenkins/workspace/EinsteinToolkit/configs/sim/configjar.git/.git' push -v -f --all '/home/jenkins/workspace/EinsteinToolkit/cactusjar.git' at /home/jenkins/workspace/EinsteinToolkit/configs/sim/scratch/Formaline/bin/update-git-repo.pl line 60, <STDIN> line 4874.

	make[1]: *** [git-store-source] Error 25

	make: *** [sim] Error 2

	Build step 'Execute shell' marked build as failure

	Archiving artifacts

	Recording test results

	ERROR: Step ‘Publish JUnit test result report’ failed: Test reports were found but none of them are new. Did tests run?

	For example, /home/jenkins/workspace/EinsteinToolkit/testresults.xml is 5 hr 49 min old

	

	IRC notifier plugin: Sending notification to: #cactus

	IRC notifier plugin: [ERROR] not connected. Cannot send message to '#cactus'

	[BFA] Scanning build for known causes...

	[BFA] No failure causes found

	[BFA] Done. 0s

	Started calculate disk usage of build

	Finished Calculation of disk usage of build in 0 seconds

	Started calculate disk usage of workspace

	Finished Calculation of disk usage of workspace in  7 second

	Email was triggered for: Failure - Any

	Sending email for trigger: Failure - Any