BUILD FAILURE

Build URL:https://build.barrywardell.net/job/EinsteinToolkit/1107/
Project:EinsteinToolkit
Date of build:Mon, 10 Mar 2014 13:15:36 +0000
Build duration:4 min 5 sec

Changes

Revision: 937af02d240a6514123abfcc1564762afd110ee5
Author:Einstein Toolkit Git Server
Log:
Updated submodules:

* arrangements/CactusNumerical/MoL 710a926...129f51b (2):
  > remove commented out and unused grid arry code
  > clarify invalid group error message, plug unobservable memory leak


Console Output


	[...truncated 3641 lines...]

	------------------------------------------------------------------------

	

	Test AHFinderDirect: Kerr-rotating-90-EE

	"EinsteinAnalysis/AHFinderDirect/test/Kerr-rotating-90-EE.par"

	

	Issuing ln -fns . output-0000-active && mkdir -p SIMFACTORY && TESTSUITE_PARFILE=/home/jenkins/workspace/simulations/EinsteinToolkit_937af02d240a6514123abfcc1564762afd110ee5_1/output-0000/arrangements/EinsteinAnalysis/AHFinderDirect/test/Kerr-rotating-90-EE.par /home/jenkins/workspace/EinsteinToolkit/../simulations/EinsteinToolkit_937af02d240a6514123abfcc1564762afd110ee5_1/output-0000/SIMFACTORY/RunScript

	

	BH_diagnostics.ah1.gp: differences below tolerance on 1 lines

	h.t0.ah1.gp: differences below tolerance on 201 lines

	

	

	

	Success: 2 files compared, 2 differ in the last digits

	

	------------------------------------------------------------------------

	

	Test AHFinderDirect: Kerr-rotating-90

	"EinsteinAnalysis/AHFinderDirect/test/Kerr-rotating-90.par"

	

	Issuing ln -fns . output-0000-active && mkdir -p SIMFACTORY && TESTSUITE_PARFILE=/home/jenkins/workspace/simulations/EinsteinToolkit_937af02d240a6514123abfcc1564762afd110ee5_1/output-0000/arrangements/EinsteinAnalysis/AHFinderDirect/test/Kerr-rotating-90.par /home/jenkins/workspace/EinsteinToolkit/../simulations/EinsteinToolkit_937af02d240a6514123abfcc1564762afd110ee5_1/output-0000/SIMFACTORY/RunScript

	

	BH_diagnostics.ah1.gp: differences below tolerance on 1 lines

	h.t0.ah1.gp: differences below tolerance on 430 lines

	

	

	

	Success: 2 files compared, 2 differ in the last digits

	

	------------------------------------------------------------------------

	

	Test AHFinderDirect: Kerr-selection-areal-radius-definition-expansion-product-EE

	"EinsteinAnalysis/AHFinderDirect/test/Kerr-selection-areal-radius-definition-expansion-product-EE.par"

	

	Issuing ln -fns . output-0000-active && mkdir -p SIMFACTORY && TESTSUITE_PARFILE=/home/jenkins/workspace/simulations/EinsteinToolkit_937af02d240a6514123abfcc1564762afd110ee5_1/output-0000/arrangements/EinsteinAnalysis/AHFinderDirect/test/Kerr-selection-areal-radius-definition-expansion-product-EE.par /home/jenkins/workspace/EinsteinToolkit/../simulations/EinsteinToolkit_937af02d240a6514123abfcc1564762afd110ee5_1/output-0000/SIMFACTORY/RunScript

	FATAL: Unable to delete script file /tmp/hudson7037749955899262030.sh

	hudson.util.IOException2: remote file operation failed: /tmp/hudson7037749955899262030.sh at hudson.remoting.Channel@382802af:caltech

	at hudson.FilePath.act(FilePath.java:906)

	at hudson.FilePath.act(FilePath.java:883)

	at hudson.FilePath.delete(FilePath.java:1268)

	at hudson.tasks.CommandInterpreter.perform(CommandInterpreter.java:101)

	at hudson.tasks.CommandInterpreter.perform(CommandInterpreter.java:60)

	at hudson.tasks.BuildStepMonitor$1.perform(BuildStepMonitor.java:19)

	at hudson.model.AbstractBuild$AbstractBuildExecution.perform(AbstractBuild.java:780)

	at hudson.model.Build$BuildExecution.build(Build.java:199)

	at hudson.model.Build$BuildExecution.doRun(Build.java:160)

	at hudson.model.AbstractBuild$AbstractBuildExecution.run(AbstractBuild.java:565)

	at hudson.model.Run.execute(Run.java:1592)

	at hudson.model.FreeStyleBuild.run(FreeStyleBuild.java:46)

	at hudson.model.ResourceController.execute(ResourceController.java:88)

	at hudson.model.Executor.run(Executor.java:237)

	Caused by: hudson.remoting.ChannelClosedException: channel is already closed

	at hudson.remoting.Channel.send(Channel.java:516)

	at hudson.remoting.Request.call(Request.java:129)

	at hudson.remoting.Channel.call(Channel.java:714)

	at hudson.FilePath.act(FilePath.java:899)

	... 13 more

	Caused by: java.io.IOException: Unexpected termination of the channel

	at hudson.remoting.SynchronousCommandTransport$ReaderThread.run(SynchronousCommandTransport.java:50)

	Caused by: java.io.EOFException

	at java.io.ObjectInputStream$BlockDataInputStream.peekByte(ObjectInputStream.java:2595)

	at java.io.ObjectInputStream.readObject0(ObjectInputStream.java:1315)

	at java.io.ObjectInputStream.readObject(ObjectInputStream.java:369)

	at hudson.remoting.Command.readFrom(Command.java:92)

	at hudson.remoting.ClassicCommandTransport.read(ClassicCommandTransport.java:71)

	at hudson.remoting.SynchronousCommandTransport$ReaderThread.run(SynchronousCommandTransport.java:48)

	FATAL: hudson.remoting.RequestAbortedException: java.io.IOException: Unexpected termination of the channel

	hudson.remoting.RequestAbortedException: hudson.remoting.RequestAbortedException: java.io.IOException: Unexpected termination of the channel

	at hudson.remoting.RequestAbortedException.wrapForRethrow(RequestAbortedException.java:41)

	at hudson.remoting.RequestAbortedException.wrapForRethrow(RequestAbortedException.java:34)

	at hudson.remoting.Request.call(Request.java:174)

	at hudson.remoting.Channel.call(Channel.java:714)

	at hudson.remoting.RemoteInvocationHandler.invoke(RemoteInvocationHandler.java:167)

	at sun.proxy.$Proxy57.join(Unknown Source)

	at hudson.Launcher$RemoteLauncher$ProcImpl.join(Launcher.java:925)

	at hudson.Launcher$ProcStarter.join(Launcher.java:360)

	at hudson.tasks.CommandInterpreter.perform(CommandInterpreter.java:91)

	at hudson.tasks.CommandInterpreter.perform(CommandInterpreter.java:60)

	at hudson.tasks.BuildStepMonitor$1.perform(BuildStepMonitor.java:19)

	at hudson.model.AbstractBuild$AbstractBuildExecution.perform(AbstractBuild.java:780)

	at hudson.model.Build$BuildExecution.build(Build.java:199)

	at hudson.model.Build$BuildExecution.doRun(Build.java:160)

	at hudson.model.AbstractBuild$AbstractBuildExecution.run(AbstractBuild.java:565)

	at hudson.model.Run.execute(Run.java:1592)

	at hudson.model.FreeStyleBuild.run(FreeStyleBuild.java:46)

	at hudson.model.ResourceController.execute(ResourceController.java:88)

	at hudson.model.Executor.run(Executor.java:237)

	Caused by: hudson.remoting.RequestAbortedException: java.io.IOException: Unexpected termination of the channel

	at hudson.remoting.Request.abort(Request.java:299)

	at hudson.remoting.Channel.terminate(Channel.java:774)

	at hudson.remoting.SynchronousCommandTransport$ReaderThread.run(SynchronousCommandTransport.java:69)

	Caused by: java.io.IOException: Unexpected termination of the channel

	at hudson.remoting.SynchronousCommandTransport$ReaderThread.run(SynchronousCommandTransport.java:50)

	Caused by: java.io.EOFException

	at java.io.ObjectInputStream$BlockDataInputStream.peekByte(ObjectInputStream.java:2595)

	at java.io.ObjectInputStream.readObject0(ObjectInputStream.java:1315)

	at java.io.ObjectInputStream.readObject(ObjectInputStream.java:369)

	at hudson.remoting.Command.readFrom(Command.java:92)

	at hudson.remoting.ClassicCommandTransport.read(ClassicCommandTransport.java:71)

	at hudson.remoting.SynchronousCommandTransport$ReaderThread.run(SynchronousCommandTransport.java:48)