BUILD FAILURE
Changes
| Revision: |
6c30842af7e231f5b284d876ba8fd9b9544d5f20 |
| Author: | Roland Haas |
| Log: | Updated submodules
|
Console Output
[...truncated 96.63 KB...]
0 schedule blocks.
SpaceMask
9 schedule blocks.
SphericalHarmonicDecomp
2 schedule blocks.
SphericalHarmonicRecon
4 schedule blocks.
SphericalHarmonicReconGen
7 schedule blocks.
SphericalSurface
8 schedule blocks.
StaticConformal
1 schedule blocks.
SummationByParts
4 schedule blocks.
SymBase
5 schedule blocks.
SystemStatistics
1 schedule blocks.
SystemTopology
1 schedule blocks.
TATelliptic
1 schedule blocks.
TGRtensor
0 schedule blocks.
TOVSolver
10 schedule blocks.
TensorTypes
0 schedule blocks.
TerminationTrigger
8 schedule blocks.
TestArrays
2 schedule blocks.
TestCarpetGridInfo
1 schedule blocks.
TestComplex
3 schedule blocks.
TestCoordinates
3 schedule blocks.
TestFortranCrayPointers
2 schedule blocks.
TestFortranDependencies1
0 schedule blocks.
TestFortranDependencies2
0 schedule blocks.
TestFpointerNULL
1 schedule blocks.
TestFreeF90
0 schedule blocks.
TestGlobalReduce
12 schedule blocks.
TestInclude1
1 schedule blocks.
TestInclude2
1 schedule blocks.
TestLocalInterp2
3 schedule blocks.
TestLocalReduce
3 schedule blocks.
TestLoop
3 schedule blocks.
TestLoopControl
3 schedule blocks.
TestMath
2 schedule blocks.
TestMoL
7 schedule blocks.
TestPar
2 schedule blocks.
TestReadWrite
CST ERROR IN FILE '/home/jenkins/workspace/EinsteinToolkit/arrangements/CactusTest/TestReadWrite/schedule.ccl' ERROR ON LINE 19:
SCHEDULE TestReadWrite_TestC_A AT initial
{
WRITES: TestReadWriteIMP::testgroup(InteriorWithBoundary)
^
| here
FOUND CHARACTER: 'W'
EXPECTED CHARACTER(S): ')'
/home/jenkins/workspace/EinsteinToolkit/lib/make/make.configuration:212: recipe for target '/home/jenkins/workspace/EinsteinToolkit/configs/sim/config-data/make.thornlist' failed
make[1]: *** [/home/jenkins/workspace/EinsteinToolkit/configs/sim/config-data/make.thornlist] Error 255
Makefile:259: recipe for target 'sim' failed
make: *** [sim] Error 2
Build step 'Execute shell' marked build as failure
Archiving artifacts
Recording test results
ERROR: Step ?Publish JUnit test result report? failed: Test reports were found but none of them are new. Did leafNodes run?
For example, /home/jenkins/workspace/EinsteinToolkit/testresults.xml is 26 min old
IRC notifier plugin: Sending notification to: #cactus
IRC notifier plugin: [ERROR] not connected. Cannot send message to '#cactus'
Started calculate disk usage of build
Finished Calculation of disk usage of build in 0 seconds
Started calculate disk usage of workspace
Finished Calculation of disk usage of workspace in 1 second
Email was triggered for: Failure - 1st
Email was triggered for: Failure - Any
Trigger Failure - Any was overridden by another trigger and will not send an email.
Trigger Failure - Still was overridden by another trigger and will not send an email.
Sending email for trigger: Failure - 1st