BUILD FAILURE

Build URL:https://build-test.barrywardell.net/job/EinsteinToolkit/1340/
Project:EinsteinToolkit
Date of build:Wed, 29 Aug 2018 14:30:53 +0000
Build duration:1 min 19 sec

Changes

Revision: 27b394f4ac820f4d71170bacff04da58c0adcc74
Author:Einstein Toolkit Git Server
Log:
Updated submodules:
* arrangements/WVUThorns dc59818...ee86e8c (3):
 > GiRaFFE Review: Address remaining comments.
 > WVUThorns/ShiftedKerrSchild: Fix compiler warning.
 > GiRaFFE documentation: Add the references.bib file
Revision: 96a7eb8af3771c0a474ab9e65688695bd1288396
Author:Einstein Toolkit Git Server
Log:
Updated submodules:
* arrangements/WVUThorns ee86e8c...3568467 (1):
 > WVUThorns/IllinoisGRMHD: Fix all GCC (v 7.3.0) compiler warnings.
Revision: 995bad673e80743a9955a28c26f349a1b26b76f4
Author:Einstein Toolkit Git Server
Log:
Updated submodules:
* arrangements/WVUThorns 3568467...0fc4287 (1):
 > GiRaFFE Review: ID_converter_GiRaFFE/schedule.ccl: Remove [3] suffix
from gridfunction group names in SYNC call.
ID_converter_ILGRMHD/schedule.ccl had the same problem. Dunno why the
parser didn't barf. Both fixed.
Revision: c288c6edbee75a0a67e77c6ff90a2953026f4c7f
Author:Einstein Toolkit Git Server
Log:
Updated submodules:
* arrangements/WVUThorns 0fc4287...8907b75 (1):
 > GiRaFFE Review: Use srand() instead of srandom() to seed rand(). Also
add comment in param.ccl explaining the use of the random_seed. Affects
ID_converter_GiRaFFE *and* ID_converter_ILGRMHD.


Artifacts

  • doc/HTML.tar.gz

  • Console Output

    
    	[...truncated 81.49 KB...]
    
    	
    
    	
    
    	CST warning in /home/jenkins/workspace/EinsteinToolkit/arrangements/WVUThorns/ID_converter_GiRaFFE/param.ccl (at 14)
    
    	-> Duplicate parameter random_seed in thorn ID_converter_GiRaFFE. Ignoring second definition
    
    	
    
    	------------------------------------------------------
    
    	
    
    	CST finished.
    
    	Checking status of thorn CoordBase
    
    	Checking status of thorn Boundary
    
    	Checking status of thorn ADMCoupling
    
    	Checking status of thorn SummationByParts
    
    	Checking status of thorn ADMMacros
    
    	Checking status of thorn ADMMass
    
    	Checking status of thorn AEILocalInterp
    
    	Checking status of thorn zlib
    
    	Checking status of thorn BLAS
    
    	Checking status of thorn GenericFD
    
    	Checking status of thorn CycleClock
    
    	Checking status of thorn Vectors
    
    	Checking status of thorn IOUtil
    
    	Checking status of thorn Fortran
    
    	Checking status of thorn CarpetRegridTest
    
    	Checking status of thorn CarpetTracker
    
    	Checking status of thorn Constants
    
    	Checking status of thorn Convert_to_HydroBase
    
    	Checking status of thorn CoordGauge
    
    	Checking status of thorn LAPACK
    
    	Checking status of thorn TensorTypes
    
    	Checking status of thorn CoordinatesSymmetry
    
    	Checking status of thorn DemoInterp
    
    	Checking status of thorn SphericalSurface
    
    	Checking status of thorn DistortedBHIVP
    
    	Checking status of thorn EOS_Base
    
    	Checking status of thorn EOS_IdealFluid
    
    	Checking status of thorn EinsteinExact_Test
    
    	Checking status of thorn EllBase
    
    	Checking status of thorn Exact
    
    	Checking status of thorn Extract
    
    	Checking status of thorn FFTW3
    
    	Checking status of thorn FleshInfo
    
    	Checking status of thorn GSL
    
    	Checking status of thorn GiRaFFE_to_HydroBase
    
    	Checking status of thorn GlobalDerivative
    
    	Checking status of thorn Socket
    
    	Checking status of thorn pthreads
    
    	Checking status of thorn HelloWorld
    
    	Checking status of thorn HighOrderWaveTest
    
    	Checking status of thorn HydroBase
    
    	Checking status of thorn Hydro_InitExcision
    
    	Checking status of thorn IDAnalyticBH
    
    	Checking status of thorn IDAxiBrillBH
    
    	Checking status of thorn IDAxiOddBrillBH
    
    	Checking status of thorn IDConstraintViolate
    
    	Checking status of thorn IDFileADM
    
    	Checking status of thorn IDLinearWaves
    
    	Checking status of thorn IDScalarWave
    
    	Checking status of thorn IDScalarWaveC
    
    	Checking status of thorn IDScalarWaveCXX
    
    	Checking status of thorn IDScalarWaveElliptic
    
    	Checking status of thorn IDWaveMoL
    
    	Checking status of thorn ID_converter_GiRaFFE
    
    	COMPILING arrangements/WVUThorns/ID_converter_GiRaFFE/src/set_GiRaFFE_metric_GRMHD_variables_based_on_HydroBase_and_ADMBase_variables.C
    
    	Checking status of thorn ID_converter_ILGRMHD
    
    	COMPILING arrangements/WVUThorns/ID_converter_ILGRMHD/src/set_IllinoisGRMHD_metric_GRMHD_variables_based_on_HydroBase_and_ADMBase_variables.C
    
    	/home/jenkins/workspace/EinsteinToolkit/configs/sim/build/ID_converter_GiRaFFE/set_GiRaFFE_metric_GRMHD_variables_based_on_HydroBase_and_ADMBase_variables.C: In function 'void set_GiRaFFE_metric_GRMHD_variables_based_on_HydroBase_and_ADMBase_variables(cGH*)':
    
    	/home/jenkins/workspace/EinsteinToolkit/configs/sim/build/ID_converter_GiRaFFE/set_GiRaFFE_metric_GRMHD_variables_based_on_HydroBase_and_ADMBase_variables.C:93:20: error: 'random_pert' was not declared in this scope
    
    	CCTK_REAL pert = (random_pert*(CCTK_REAL)rand() / RAND_MAX);
    
    	^
    
    	/home/jenkins/workspace/EinsteinToolkit/configs/sim/config-data/make.config.rules:290: recipe for target 'set_GiRaFFE_metric_GRMHD_variables_based_on_HydroBase_and_ADMBase_variables.C.o' failed
    
    	make[3]: *** [set_GiRaFFE_metric_GRMHD_variables_based_on_HydroBase_and_ADMBase_variables.C.o] Error 1
    
    	/home/jenkins/workspace/EinsteinToolkit/lib/make/make.thornlib:112: recipe for target 'make.checked' failed
    
    	make[2]: *** [make.checked] Error 2
    
    	/home/jenkins/workspace/EinsteinToolkit/lib/make/make.configuration:181: recipe for target '/home/jenkins/workspace/EinsteinToolkit/configs/sim/lib/libthorn_ID_converter_GiRaFFE.a' failed
    
    	make[1]: *** [/home/jenkins/workspace/EinsteinToolkit/configs/sim/lib/libthorn_ID_converter_GiRaFFE.a] Error 2
    
    	make[1]: *** Waiting for unfinished jobs....
    
    	Updating /home/jenkins/workspace/EinsteinToolkit/configs/sim/lib/libthorn_ID_converter_ILGRMHD.a
    
    	Makefile:256: recipe for target 'sim' failed
    
    	make: *** [sim] Error 2
    
    	Build step 'Execute shell' marked build as failure
    
    	Archiving artifacts
    
    	Recording test results
    
    	ERROR: Step ?Publish JUnit test result report? failed: Test reports were found but none of them are new. Did tests run?
    
    	For example, /home/jenkins/workspace/EinsteinToolkit/testresults.xml is 1 hr 37 min old
    
    	
    
    	IRC notifier plugin: Sending notification to: #cactus
    
    	IRC notifier plugin: [ERROR] not connected. Cannot send message to '#cactus'
    
    	[BFA] Scanning build for known causes...
    
    	[BFA] No failure causes found
    
    	[BFA] Done. 0s
    
    	Started calculate disk usage of build
    
    	Finished Calculation of disk usage of build in 0 seconds
    
    	Started calculate disk usage of workspace
    
    	Finished Calculation of disk usage of workspace in  2 second
    
    	Email was triggered for: Failure - 1st
    
    	Email was triggered for: Failure - Any
    
    	Trigger Failure - Any was overridden by another trigger and will not send an email.
    
    	Trigger Failure - Still was overridden by another trigger and will not send an email.
    
    	Sending email for trigger: Failure - 1st