BUILD FAILURE
Changes
| Revision: |
63f5d295da7c22a1f991ce83fed639ddf263706d |
| Author: | Einstein Toolkit Git Server |
| Log: | Updated submodules:
* arrangements/CactusTest a74e808...f712bc6 (1):
> Merged in eschnett/aligned-interior (pull request #1)
* arrangements/ExternalLibraries/pciutils d7f6298...9efae6b (1):
> Roland Haas, #1657: This patch removes the hard-coded CC and AR from the Makefile and builds pciutils using MKL and -openmp flags with the intel compiler. It also builds on a stock Linux (Debian Squeeze) system where gcc is used.
* flesh 079f019...5512e99 (1):
> Merged in eschnett/aligned-interior (pull request #16)
|
| Revision: |
221179e1b03d3e895d8920651d3e16c1e8b802ea |
| Author: | Einstein Toolkit Git Server |
| Log: | Updated submodules:
* repos/carpet 793f30b...2e8ea39 (1):
> Merged in recompose-balance-partial-fix (pull request #10)
|
Console Output
[...truncated 3520 lines...]
COMPILING arrangements/CactusNumerical/SummationByParts/src/Derivatives2_6_3.F90
COMPILING arrangements/CactusNumerical/SummationByParts/src/Derivatives_6_3_min_err_coeff.F90
COMPILING arrangements/CactusNumerical/SummationByParts/src/Derivatives_8_4.F90
COMPILING arrangements/CactusNumerical/SummationByParts/src/Derivatives2_8_4.F90
COMPILING arrangements/CactusNumerical/SummationByParts/src/Derivatives_8_4_min_err_coeff.F90
COMPILING arrangements/CactusNumerical/SummationByParts/src/Derivatives_4_3.F90
COMPILING arrangements/CactusNumerical/SummationByParts/src/Derivatives_4_3_min_err_coeff.F90
COMPILING arrangements/CactusNumerical/SummationByParts/src/Derivatives_6_5.F90
COMPILING arrangements/CactusNumerical/SummationByParts/src/Derivatives_6_5_min_err_coeff.F90
COMPILING arrangements/CactusNumerical/SummationByParts/src/Dissipation_4_3_min_err_coeff.F90
/home/jenkins/workspace/EinsteinToolkit/arrangements/CactusNumerical/SummationByParts/src/Dissipation_4_3_min_err_coeff.F90:470.32:
subroutine set_bmatrix ( b, bb, lsh, gsh, lbnd, h, dfl )
1
Warning: Unused dummy argument 'bb' at (1)
/home/jenkins/workspace/EinsteinToolkit/arrangements/CactusNumerical/SummationByParts/src/Dissipation_4_3_min_err_coeff.F90:470.37:
subroutine set_bmatrix ( b, bb, lsh, gsh, lbnd, h, dfl )
1
Warning: Unused dummy argument 'lsh' at (1)
/home/jenkins/workspace/EinsteinToolkit/configs/sim/build/SummationByParts/Dissipation_4_3_min_err_coeff.f90: In function ‘dissipation_4_3_opt’:
/home/jenkins/workspace/EinsteinToolkit/configs/sim/build/SummationByParts/Dissipation_4_3_min_err_coeff.f90:388:0: warning: ‘nkk’ may be used uninitialized in this function [-Wuninitialized]
/home/jenkins/workspace/EinsteinToolkit/configs/sim/build/SummationByParts/Dissipation_4_3_min_err_coeff.f90:38:0: note: ‘nkk’ was declared here
/home/jenkins/workspace/EinsteinToolkit/configs/sim/build/SummationByParts/Dissipation_4_3_min_err_coeff.f90:256:0: warning: ‘njj’ may be used uninitialized in this function [-Wuninitialized]
/home/jenkins/workspace/EinsteinToolkit/configs/sim/build/SummationByParts/Dissipation_4_3_min_err_coeff.f90:165:0: warning: ‘ol’ may be used uninitialized in this function [-Wuninitialized]
/home/jenkins/workspace/EinsteinToolkit/configs/sim/build/SummationByParts/Dissipation_4_3_min_err_coeff.f90:127:0: warning: ‘nii’ may be used uninitialized in this function [-Wuninitialized]
COMPILING arrangements/CactusNumerical/SummationByParts/src/Dissipation_4_3_min_err_coeff_alt.F90
/home/jenkins/workspace/EinsteinToolkit/arrangements/CactusNumerical/SummationByParts/src/Dissipation_4_3_min_err_coeff_alt.F90:693.32:
subroutine set_bmatrix ( b, bb, lsh, gsh, lbnd, h, dfl )
1
Warning: Unused dummy argument 'bb' at (1)
/home/jenkins/workspace/EinsteinToolkit/arrangements/CactusNumerical/SummationByParts/src/Dissipation_4_3_min_err_coeff_alt.F90:693.37:
subroutine set_bmatrix ( b, bb, lsh, gsh, lbnd, h, dfl )
1
Warning: Unused dummy argument 'lsh' at (1)
COMPILING arrangements/CactusNumerical/SummationByParts/src/Dissipation_6_5_min_err_coeff.F90
/home/jenkins/workspace/EinsteinToolkit/arrangements/CactusNumerical/SummationByParts/src/Dissipation_6_5_min_err_coeff.F90:842.32:
subroutine set_bmatrix ( b, bb, lsh, gsh, lbnd, h, dfl )
1
Warning: Unused dummy argument 'bb' at (1)
/home/jenkins/workspace/EinsteinToolkit/arrangements/CactusNumerical/SummationByParts/src/Dissipation_6_5_min_err_coeff.F90:842.37:
subroutine set_bmatrix ( b, bb, lsh, gsh, lbnd, h, dfl )
1
Warning: Unused dummy argument 'lsh' at (1)
COMPILING arrangements/CactusNumerical/SummationByParts/src/Dissipation_6_5_min_err_coeff_alt.F90
/home/jenkins/workspace/EinsteinToolkit/arrangements/CactusNumerical/SummationByParts/src/Dissipation_6_5_min_err_coeff_alt.F90:711.32:
subroutine set_bmatrix ( b, bb, lsh, gsh, lbnd, h, dfl )
1
Warning: Unused dummy argument 'bb' at (1)
/home/jenkins/workspace/EinsteinToolkit/arrangements/CactusNumerical/SummationByParts/src/Dissipation_6_5_min_err_coeff_alt.F90:711.37:
subroutine set_bmatrix ( b, bb, lsh, gsh, lbnd, h, dfl )
1
Warning: Unused dummy argument 'lsh' at (1)
/home/jenkins/workspace/EinsteinToolkit/configs/sim/build/SummationByParts/Dissipation_4_3_min_err_coeff_alt.f90: In function ‘dissipation_4_3_alt’:
/home/jenkins/workspace/EinsteinToolkit/configs/sim/build/SummationByParts/Dissipation_4_3_min_err_coeff_alt.f90:534:0: warning: ‘nkk’ may be used uninitialized in this function [-Wuninitialized]
/home/jenkins/workspace/EinsteinToolkit/configs/sim/build/SummationByParts/Dissipation_4_3_min_err_coeff_alt.f90:38:0: note: ‘nkk’ was declared here
/home/jenkins/workspace/EinsteinToolkit/configs/sim/build/SummationByParts/Dissipation_4_3_min_err_coeff_alt.f90:350:0: warning: ‘njj’ may be used uninitialized in this function [-Wuninitialized]
/home/jenkins/workspace/EinsteinToolkit/configs/sim/build/SummationByParts/Dissipation_4_3_min_err_coeff_alt.f90:214:0: warning: ‘ol’ may be used uninitialized in this function [-Wuninitialized]
/home/jenkins/workspace/EinsteinToolkit/configs/sim/build/SummationByParts/Dissipation_4_3_min_err_coeff_alt.f90:167:0: warning: ‘nii’ may be used uninitialized in this function [-Wuninitialized]
/home/jenkins/workspace/EinsteinToolkit/configs/sim/build/SummationByParts/Dissipation_6_5_min_err_coeff.f90: In function ‘dissipation_6_5_opt’:
/home/jenkins/workspace/EinsteinToolkit/configs/sim/build/SummationByParts/Dissipation_6_5_min_err_coeff.f90:655:0: warning: ‘nkk’ may be used uninitialized in this function [-Wuninitialized]
/home/jenkins/workspace/EinsteinToolkit/configs/sim/build/SummationByParts/Dissipation_6_5_min_err_coeff.f90:38:0: note: ‘nkk’ was declared here
/home/jenkins/workspace/EinsteinToolkit/configs/sim/build/SummationByParts/Dissipation_6_5_min_err_coeff.f90:421:0: warning: ‘njj’ may be used uninitialized in this function [-Wuninitialized]
/home/jenkins/workspace/EinsteinToolkit/configs/sim/build/SummationByParts/Dissipation_6_5_min_err_coeff.f90:262:0: warning: ‘ol’ may be used uninitialized in this function [-Wuninitialized]
/home/jenkins/workspace/EinsteinToolkit/configs/sim/build/SummationByParts/Dissipation_6_5_min_err_coeff.f90:187:0: warning: ‘nii’ may be used uninitialized in this function [-Wuninitialized]
/home/jenkins/workspace/EinsteinToolkit/configs/sim/build/SummationByParts/Dissipation_6_5_min_err_coeff_alt.f90: In function ‘dissipation_6_5_alt’:
/home/jenkins/workspace/EinsteinToolkit/configs/sim/build/SummationByParts/Dissipation_6_5_min_err_coeff_alt.f90:572:0: warning: ‘nkk’ may be used uninitialized in this function [-Wuninitialized]
/home/jenkins/workspace/EinsteinToolkit/configs/sim/build/SummationByParts/Dissipation_6_5_min_err_coeff_alt.f90:38:0: note: ‘nkk’ was declared here
/home/jenkins/workspace/EinsteinToolkit/configs/sim/build/SummationByParts/Dissipation_6_5_min_err_coeff_alt.f90:373:0: warning: ‘njj’ may be used uninitialized in this function [-Wuninitialized]
/home/jenkins/workspace/EinsteinToolkit/configs/sim/build/SummationByParts/Dissipation_6_5_min_err_coeff_alt.f90:241:0: warning: ‘ol’ may be used uninitialized in this function [-Wuninitialized]
/home/jenkins/workspace/EinsteinToolkit/configs/sim/build/SummationByParts/Dissipation_6_5_min_err_coeff_alt.f90:158:0: warning: ‘nii’ may be used uninitialized in this function [-Wuninitialized]
Updating /home/jenkins/workspace/EinsteinToolkit/configs/sim/lib/libthorn_SummationByParts.a
make: *** [sim] Error 2
Build step 'Execute shell' marked build as failure
Archiving artifacts
Recording test results
ERROR: Step ‘Publish JUnit test result report’ failed: Test reports were found but none of them are new. Did tests run?
For example, /home/jenkins/workspace/EinsteinToolkit/testresults.xml is 23 hr old
IRC notifier plugin: Sending notification to: #cactus
IRC notifier plugin: [ERROR] not connected. Cannot send message to '#cactus'
[BFA] Scanning build for known causes...
[BFA] No failure causes found
[BFA] Done. 0s
Started calculate disk usage of build
Finished Calculation of disk usage of build in 0 seconds
Started calculate disk usage of workspace
Finished Calculation of disk usage of workspace in 5 second
Email was triggered for: Failure - 1st
Email was triggered for: Failure - Any
Trigger Failure - Any was overridden by another trigger and will not send an email.
Trigger Failure - Still was overridden by another trigger and will not send an email.
Sending email for trigger: Failure - 1st