BUILD FAILURE
Changes
| Revision: |
0dd669495df0e11b614bff0b54bf98e3448567cf |
| Author: | Barry Wardell |
| Log: | Update URL for Carpet
|
Console Output
[...truncated 2035 lines...]
+++ pkg-config libpci --libs
++ echo '' -L/home/jenkins/workspace/EinsteinToolkit/configs/sim/scratch/external/pciutils/lib -lpci ''
+ PCIUTILS_LIB_DIRS=' /home/jenkins/workspace/EinsteinToolkit/configs/sim/scratch/external/pciutils/lib '
++ sed -e 's/ -[^l][^ ]*/ /g'
++ sed -e 's/ -l/ /g'
+++ pkg-config libpci --libs
++ echo '' -L/home/jenkins/workspace/EinsteinToolkit/configs/sim/scratch/external/pciutils/lib -lpci ''
+ PCIUTILS_LIBS=' pci '
+ echo 'BEGIN MAKE_DEFINITION'
+ echo 'HAVE_PCIUTILS = 1'
+ echo 'PCIUTILS_DIR = /home/jenkins/workspace/EinsteinToolkit/configs/sim/scratch/external/pciutils'
+ echo 'PCIUTILS_INC_DIRS = /home/jenkins/workspace/EinsteinToolkit/configs/sim/scratch/external/pciutils/include '
+ echo 'PCIUTILS_LIB_DIRS = /home/jenkins/workspace/EinsteinToolkit/configs/sim/scratch/external/pciutils/lib '
+ echo 'PCIUTILS_LIBS = pci '
+ echo 'END MAKE_DEFINITION'
+ echo 'INCLUDE_DIRECTORY $(PCIUTILS_INC_DIRS)'
+ echo 'LIBRARY_DIRECTORY $(PCIUTILS_LIB_DIRS)'
+ echo 'LIBRARY $(PCIUTILS_LIBS)'
Building pciutils...
Finished running configuration script for thorn PCIUTILS.
********************************************************************************
Running configuration script for thorn HWLOC:
hwloc selected, but HWLOC_DIR not set. Checking some places...
hwloc not found
Using bundled hwloc...
hwloc has already been built; doing nothing
Finished running configuration script for thorn HWLOC.
Checking consistency...
Creating Thorn-Flesh bindings...
Creating implementation bindings...
Creating parameter bindings...
Creating variable bindings...
Creating schedule bindings...
Creating function bindings...
------------------------------------------------------
There were 10 errors during execution of the CST
These must be corrected before compilation can proceed
------------------------------------------------------
------------------------------------------------------
Warnings were generated during execution of the CST
------------------------------------------------------
CST error 1:
-> Missing thorn Carpet/CarpetIntegrateTest
CST error 2:
-> Missing thorn Carpet/CarpetProlongateTest
CST error 3:
-> Missing thorn Carpet/CarpetRegridTest
CST error 4:
-> Missing thorn Carpet/HighOrderWaveTest
CST error 5:
-> Missing thorn Carpet/ReductionTest
CST error 6:
-> Missing thorn Carpet/ReductionTest2
CST error 7:
-> Missing thorn Carpet/ReductionTest3
CST error 8:
-> Missing thorn Carpet/RegridSyncTest
CST error 9:
-> Missing thorn Carpet/TestCarpetGridInfo
CST error 10:
-> Missing thorn Carpet/TestLoopControl
------------------------------------------------------
make[1]: *** [/home/jenkins/workspace/EinsteinToolkit/configs/sim/config-data/make.thornlist] Error 1
make: *** [sim] Error 2
Build step 'Execute shell' marked build as failure
Archiving artifacts
Recording test results
IRC notifier plugin: Sending notification to: #cactus
IRC notifier plugin: [ERROR] not connected. Cannot send message to '#cactus'
Email was triggered for: Failure - Any
Sending email for trigger: Failure - Any