BUILD FAILURE
Changes
| Revision: |
3f3137aeabff22ceb8ec11a6b132d93215787b30 |
| Author: | Einstein Toolkit Git Server |
| Log: | Updated submodules:
* arrangements/CactusBase e943ba8...dc7b6d7 (6):
> Timer: remove explicit include of cctk_Arguments_Checked
> SymBase: remove explicit include of cctk_Arguments_Checked
> IOBasic: remove explicit include of cctk_Arguments_Checked
> CartGrid3D: remove explicit include of cctk_Arguments_Checked
> Boundary: use Driver_NotifyDataModified instead of Driver_SetValidRegion
> Revert "Boundary: schedule ApplyBCs in Driver_ApplyBCs"
* arrangements/CactusExamples 7ec2925...8b4871d (3):
> WaveMoL: remove explicit include of cctk_Arguments_Checked
> Poisson: remove explicit include of cctk_Arguments_Checked
> IDWaveMoL: remove explicit include of cctk_Arguments_Checked
* arrangements/CactusNumerical 043d3e8...b799ffb (10):
> SummationByParts: remove explicit include of cctk_Arguments_Checked
> SphericalSurface: remove explicit include of cctk_Arguments_Checked
> SpaceMask: remove explicit include of cctk_Arguments_Checked
> Slab: remove explicit include of cctk_Arguments_Checked
> ReflectionSymmetry: remove explicit include of cctk_Arguments_Checked
> InterpToArray: remove explicit include of cctk_Arguments_Checked
> Dissipation: remove explicit include of cctk_Arguments_Checked
> Cartoon2D: remove explicit include of cctk_Arguments_Checked
> MoL: set valid in linearcombination
> MoL: pass cctkGH to Get/SetValidRegion
* arrangements/CactusTest c3bf72a...9609a32 (5):
> TestReadWrite: remove explicit include of cctk_Arguments_Checked
> TestPar: remove explicit include of cctk_Arguments_Checked
> TestAutoSync: remove explicit include of cctk_Arguments_Checked
> TestReadWrite: pass cctkGH to GetValidRegion
> TestAutoSync: re-add accidentally removed test data
* arrangements/CactusWave f2d5f60...8148e7e (2):
> CactusWave/WaveToyC: remove explicit include of cctk_Arguments_Checked
> CactusWave/IDScalarWaveC: remove explicit include of cctk_Arguments_Checked
* arrangements/EinsteinAnalysis 87f10ea...6a261a6 (3):
> EinsteinAnalysis/Multipole: remove explicit include of cctk_Arguments_Checked
> EinsteinAnalysis/AHFinderDirect: remove explicit include of cctk_Arguments_Checked
> EinsteinAnalysis/ADMAnalysis: remove explicit include of cctk_Arguments_Checked
* arrangements/EinsteinBase a04393b...1b321ec (5):
> EinsteinBase/TmunuBase: remove explicit include of cctk_Arguments_Checked
> EinsteinBase/StaticConformal: remove explicit include of cctk_Arguments_Checked
> EinsteinBase/HydroBase: remove explicit include of cctk_Arguments_Checked
> EinsteinBase/ADMMacros: remove explicit include of cctk_Arguments_Checked
> EinsteinBase/ADMBase: remove explicit include of cctk_Arguments_Checked
* arrangements/EinsteinEOS ebef761...f83baec (1):
> EinsteinEOS/EOS_Omni: remove explicit include of cctk_Arguments_Checked
* arrangements/EinsteinInitialData d8cd892...dd41c90 (6):
> EinsteinInitialData/TwoPunctures: remove explicit include of cctk_Arguments_Checked
> EinsteinInitialData/TOVSolver: remove explicit include of cctk_Arguments_Checked
> EinsteinInitialData/NoExcision: remove explicit include of cctk_Arguments_Checked
> EinsteinInitialData/IDAxiBrillBH: remove explicit include of cctk_Arguments_Checked
> EinsteinInitialData/IDAnalyticBH: remove explicit include of cctk_Arguments_Checked
> EinsteinInitialData/Exact: remove explicit include of cctk_Arguments_Checked
* repos/CRL f4f9b23...e0bd6a5 (1):
> GetComponents: ignore transport and username when comparing git URLs
* repos/EinsteinExact f37e292...f1619f3 (6):
> EinsteinExact/Vaidya2: remove explicit include of cctk_Arguments_Checked
> EinsteinExact/ShiftedGaugeWave: remove explicit include of cctk_Arguments_Checked
> EinsteinExact/ModifiedSchwarzschildBL: remove explicit include of cctk_Arguments_Checked
> EinsteinExact/Minkowski: remove explicit include of cctk_Arguments_Checked
> EinsteinExact/KerrSchild: remove explicit include of cctk_Arguments_Checked
> EinsteinExact/GaugeWave: remove explicit include of cctk_Arguments_Checked
* repos/carpet bd90207...55288d3 (30):
> RegridSyncTest: remove explicit include of cctk_Arguments_Checked
> ReductionTest3: remove explicit include of cctk_Arguments_Checked
> ReductionTest2: remove explicit include of cctk_Arguments_Checked
> ReductionTest: remove explicit include of cctk_Arguments_Checked
> LoopControl: remove explicit include of cctk_Arguments_Checked
> CarpetTracker: remove explicit include of cctk_Arguments_Checked
> CarpetRegridTest: remove explicit include of cctk_Arguments_Checked
> CarpetRegrid2: remove explicit include of cctk_Arguments_Checked
> CarpetRegrid: remove explicit include of cctk_Arguments_Checked
> CarpetReduce: remove explicit include of cctk_Arguments_Checked
> CarpetProlongateTest: remove explicit include of cctk_Arguments_Checked
> CarpetMask: remove explicit include of cctk_Arguments_Checked
> CarpetLib: remove explicit include of cctk_Arguments_Checked
> CartIntegrateTest: remove explicit include of cctk_Arguments_Checked
> CarpetIOScalar: remove explicit include of cctk_Arguments_Checked
> CarpetIOHDF5: remove explicit include of cctk_Arguments_Checked
> CarpetIOBasic: remove explicit include of cctk_Arguments_Checked
> CarpetIOASCII: remove explicit include of cctk_Arguments_Checked
> CarpetEvolutionMask: remove explicit include of cctk_Arguments_Checked
> Carpet: remove explicit include of cctk_Arguments_Checked
> Carpet: add cctkGH to Set/GetValidRegion functions
> Carpet: add error checking to validity aliased functions
> Carpet: add Driver_NotifyDataModified aliased function
> Carpet: fix calling Driver_RequireValid from non-level modes
> CarpetIOBasic: use Driver_RequireValidData to SYNC before output
> CarpetIOScalar: replace Driver_ManualSyncGF by Driver_RequireValidData
> CarpetIOHDF5: replace Driver_ManualSyncGF by Driver_RequireValidData
> CarpetIOASCII: replace Driver_ManualSyncGF by Driver_RequireValidData
> Carpet: replace Driver_ManualSyncGF by Driver_RequireValidData
> Carpet: do no rely on Boundary to schedule its ApplyBCs routine
|
Console Output
[...truncated 117.31 KB...]
&efac,cctk_convlevel,cctk_convfac,cctk_nghostzones,cctk_iteration,cctkGH,cctk_ash1,cctk_ash2,cctk_ash3, nmask,sbp_dx,sbp_dy,sbp_d&
1
Error: Symbol 'cctk_convlevel' at (1) has no IMPLICIT type
/home/jenkins/workspace/EinsteinToolkit/configs/sim/build/SummationByParts/set_norm_mask.f90:4:35:
&efac,cctk_convlevel,cctk_convfac,cctk_nghostzones,cctk_iteration,cctkGH,cctk_ash1,cctk_ash2,cctk_ash3, nmask,sbp_dx,sbp_dy,sbp_d&
1
Error: Symbol 'cctk_convfac' at (1) has no IMPLICIT type
/home/jenkins/workspace/EinsteinToolkit/configs/sim/build/SummationByParts/set_norm_mask.f90:4:52:
&efac,cctk_convlevel,cctk_convfac,cctk_nghostzones,cctk_iteration,cctkGH,cctk_ash1,cctk_ash2,cctk_ash3, nmask,sbp_dx,sbp_dy,sbp_d&
1
Error: Symbol 'cctk_nghostzones' at (1) has no IMPLICIT type
/home/jenkins/workspace/EinsteinToolkit/configs/sim/build/SummationByParts/set_norm_mask.f90:4:67:
&efac,cctk_convlevel,cctk_convfac,cctk_nghostzones,cctk_iteration,cctkGH,cctk_ash1,cctk_ash2,cctk_ash3, nmask,sbp_dx,sbp_dy,sbp_d&
1
Error: Symbol 'cctk_iteration' at (1) has no IMPLICIT type
/home/jenkins/workspace/EinsteinToolkit/configs/sim/build/SummationByParts/set_norm_mask.f90:4:74:
&efac,cctk_convlevel,cctk_convfac,cctk_nghostzones,cctk_iteration,cctkGH,cctk_ash1,cctk_ash2,cctk_ash3, nmask,sbp_dx,sbp_dy,sbp_d&
1
Error: Symbol 'cctkgh' at (1) has no IMPLICIT type
/home/jenkins/workspace/EinsteinToolkit/configs/sim/build/SummationByParts/set_norm_mask.f90:4:84:
&efac,cctk_convlevel,cctk_convfac,cctk_nghostzones,cctk_iteration,cctkGH,cctk_ash1,cctk_ash2,cctk_ash3, nmask,sbp_dx,sbp_dy,sbp_d&
1
Error: Symbol 'cctk_ash1' at (1) has no IMPLICIT type
/home/jenkins/workspace/EinsteinToolkit/configs/sim/build/SummationByParts/set_norm_mask.f90:4:94:
&efac,cctk_convlevel,cctk_convfac,cctk_nghostzones,cctk_iteration,cctkGH,cctk_ash1,cctk_ash2,cctk_ash3, nmask,sbp_dx,sbp_dy,sbp_d&
1
Error: Symbol 'cctk_ash2' at (1) has no IMPLICIT type
/home/jenkins/workspace/EinsteinToolkit/configs/sim/build/SummationByParts/set_norm_mask.f90:4:104:
&efac,cctk_convlevel,cctk_convfac,cctk_nghostzones,cctk_iteration,cctkGH,cctk_ash1,cctk_ash2,cctk_ash3, nmask,sbp_dx,sbp_dy,sbp_d&
1
Error: Symbol 'cctk_ash3' at (1) has no IMPLICIT type
/home/jenkins/workspace/EinsteinToolkit/configs/sim/build/SummationByParts/set_norm_mask.f90:4:111:
&efac,cctk_convlevel,cctk_convfac,cctk_nghostzones,cctk_iteration,cctkGH,cctk_ash1,cctk_ash2,cctk_ash3, nmask,sbp_dx,sbp_dy,sbp_d&
1
Error: Symbol 'nmask' at (1) has no IMPLICIT type
/home/jenkins/workspace/EinsteinToolkit/configs/sim/build/SummationByParts/set_norm_mask.f90:4:118:
&efac,cctk_convlevel,cctk_convfac,cctk_nghostzones,cctk_iteration,cctkGH,cctk_ash1,cctk_ash2,cctk_ash3, nmask,sbp_dx,sbp_dy,sbp_d&
1
Error: Symbol 'sbp_dx' at (1) has no IMPLICIT type
/home/jenkins/workspace/EinsteinToolkit/configs/sim/build/SummationByParts/set_norm_mask.f90:4:125:
&efac,cctk_convlevel,cctk_convfac,cctk_nghostzones,cctk_iteration,cctkGH,cctk_ash1,cctk_ash2,cctk_ash3, nmask,sbp_dx,sbp_dy,sbp_d&
1
Error: Symbol 'sbp_dy' at (1) has no IMPLICIT type
/home/jenkins/workspace/EinsteinToolkit/configs/sim/build/SummationByParts/set_norm_mask.f90:5:4:
&z)
1
Error: Symbol 'sbp_dz' at (1) has no IMPLICIT type
/home/jenkins/workspace/EinsteinToolkit/configs/sim/build/SummationByParts/set_norm_mask.f90:295:7:
ni = cctk_lsh(1); nj = cctk_lsh(2); nk = cctk_lsh(3)
1
Error: Function 'cctk_lsh' at (1) has no IMPLICIT type
/home/jenkins/workspace/EinsteinToolkit/configs/sim/build/SummationByParts/set_norm_mask.f90:295:25:
ni = cctk_lsh(1); nj = cctk_lsh(2); nk = cctk_lsh(3)
1
Error: Function 'cctk_lsh' at (1) has no IMPLICIT type
/home/jenkins/workspace/EinsteinToolkit/configs/sim/build/SummationByParts/set_norm_mask.f90:295:43:
ni = cctk_lsh(1); nj = cctk_lsh(2); nk = cctk_lsh(3)
1
Error: Function 'cctk_lsh' at (1) has no IMPLICIT type
/home/jenkins/workspace/EinsteinToolkit/configs/sim/config-data/make.config.rules:409: recipe for target 'set_norm_mask.F90.o' failed
make[3]: *** [set_norm_mask.F90.o] Error 1
make[3]: *** Waiting for unfinished jobs....
/home/jenkins/workspace/EinsteinToolkit/lib/make/make.thornlib:112: recipe for target 'make.checked' failed
make[2]: *** [make.checked] Error 2
/home/jenkins/workspace/EinsteinToolkit/lib/make/make.configuration:179: recipe for target '/home/jenkins/workspace/EinsteinToolkit/configs/sim/lib/libthorn_SummationByParts.a' failed
make[1]: *** [/home/jenkins/workspace/EinsteinToolkit/configs/sim/lib/libthorn_SummationByParts.a] Error 2
Makefile:259: recipe for target 'sim' failed
make: *** [sim] Error 2
Build step 'Execute shell' marked build as failure
Archiving artifacts
Recording test results
ERROR: Step ?Publish JUnit test result report? failed: Test reports were found but none of them are new. Did leafNodes run?
For example, /home/jenkins/workspace/EinsteinToolkit/testresults.xml is 2 days 7 hr old
IRC notifier plugin: Sending notification to: #cactus
IRC notifier plugin: [ERROR] not connected. Cannot send message to '#cactus'
Started calculate disk usage of build
Finished Calculation of disk usage of build in 0 seconds
Started calculate disk usage of workspace
Finished Calculation of disk usage of workspace in 4 second
Email was triggered for: Failure - 1st
Email was triggered for: Failure - Any
Trigger Failure - Any was overridden by another trigger and will not send an email.
Trigger Failure - Still was overridden by another trigger and will not send an email.
Sending email for trigger: Failure - 1st