BUILD FAILURE

Build URL:https://build.barrywardell.net/job/EinsteinToolkit/1686/
Project:EinsteinToolkit
Date of build:Mon, 06 Jul 2020 14:14:16 +0000
Build duration:22 min

Changes

Revision: 3c8b2a8eed2e5cf7835f2fb2d69798074b1cc5c6
Author:Roland Haas
Log:
Updated submodules


Console Output


	[...truncated 603.96 KB...]

	Checking status of thorn Vaidya2

	COMPILING EinsteinExact/Vaidya2/src/Boundaries.cc

	COMPILING EinsteinExact/Vaidya2/src/Kranc.cc

	COMPILING EinsteinExact/Vaidya2/src/ParamCheck.cc

	COMPILING EinsteinExact/Vaidya2/src/RegisterMoL.cc

	COMPILING EinsteinExact/Vaidya2/src/RegisterSymmetries.cc

	COMPILING EinsteinExact/Vaidya2/src/Startup.cc

	COMPILING EinsteinExact/Vaidya2/src/Vaidya2_always.cc

	COMPILING EinsteinExact/Vaidya2/src/Vaidya2_exact.cc

	COMPILING EinsteinAnalysis/QuasiLocalMeasures/src/qlm_weyl_scalars.F90

	COMPILING EinsteinExact/Vaidya2/src/Vaidya2_initial.cc

	Updating /home/jenkins/workspace/EinsteinToolkit/configs/sim/lib/libthorn_Vaidya2.a

	Checking status of thorn WeylScal4

	COMPILING EinsteinAnalysis/WeylScal4/src/Boundaries.cc

	COMPILING EinsteinAnalysis/WeylScal4/src/Kranc.cc

	COMPILING EinsteinAnalysis/WeylScal4/src/RegisterMoL.cc

	COMPILING EinsteinAnalysis/WeylScal4/src/RegisterSymmetries.cc

	COMPILING EinsteinAnalysis/WeylScal4/src/Startup.cc

	COMPILING EinsteinAnalysis/WeylScal4/src/WeylScal4_invars_calc_2nd.cc

	COMPILING EinsteinAnalysis/WeylScal4/src/WeylScal4_invars_calc_4th.cc

	COMPILING EinsteinAnalysis/WeylScal4/src/WeylScal4_invars_calc_Nth.cc

	COMPILING EinsteinAnalysis/WeylScal4/src/WeylScal4_psi4_calc_2nd.cc

	COMPILING EinsteinAnalysis/WeylScal4/src/WeylScal4_psi4_calc_4th.cc

	COMPILING EinsteinAnalysis/WeylScal4/src/WeylScal4_psi4_calc_Nth.cc

	COMPILING EinsteinAnalysis/WeylScal4/src/WeylScal4_psis_calc_2nd.cc

	COMPILING EinsteinAnalysis/WeylScal4/src/WeylScal4_psis_calc_4th.cc

	COMPILING EinsteinAnalysis/WeylScal4/src/WeylScal4_psis_calc_Nth.cc

	COMPILING EinsteinAnalysis/QuasiLocalMeasures/src/qlm_weyl_scalars1.F90

	/home/jenkins/workspace/EinsteinToolkit/configs/sim/build/QuasiLocalMeasures/qlm_weyl_scalars1.f90:1121:34:

	

	qlm_phi11(i,j,hn) = qlm_phi11(i,j,hn) - 1/two * ri4(a,b) * (ll(a) * nn(b) + mm(a) * conjg(mm(b))) / 2

	1

	Warning: Possible change of value in conversion from COMPLEX(8) to REAL(8) at (1) [-Wconversion]

	/home/jenkins/workspace/EinsteinToolkit/configs/sim/build/QuasiLocalMeasures/qlm_weyl_scalars1.f90:1122:34:

	

	qlm_phi01(i,j,hn) = qlm_phi01(i,j,hn) - 1/two * ri4(a,b) * ll(a) * mm(b)

	1

	Warning: Possible change of value in conversion from COMPLEX(8) to REAL(8) at (1) [-Wconversion]

	/home/jenkins/workspace/EinsteinToolkit/configs/sim/build/QuasiLocalMeasures/qlm_weyl_scalars1.f90:1123:34:

	

	qlm_phi12(i,j,hn) = qlm_phi12(i,j,hn) - 1/two * ri4(a,b) * nn(a) * mm(b)

	1

	Warning: Possible change of value in conversion from COMPLEX(8) to REAL(8) at (1) [-Wconversion]

	/home/jenkins/workspace/EinsteinToolkit/configs/sim/build/QuasiLocalMeasures/qlm_weyl_scalars1.f90:1124:34:

	

	qlm_phi10(i,j,hn) = qlm_phi10(i,j,hn) - 1/two * ri4(a,b) * ll(a) * conjg(mm(b))

	1

	Warning: Possible change of value in conversion from COMPLEX(8) to REAL(8) at (1) [-Wconversion]

	/home/jenkins/workspace/EinsteinToolkit/configs/sim/build/QuasiLocalMeasures/qlm_weyl_scalars1.f90:1125:34:

	

	qlm_phi21(i,j,hn) = qlm_phi21(i,j,hn) - 1/two * ri4(a,b) * nn(a) * conjg(mm(b))

	1

	Warning: Possible change of value in conversion from COMPLEX(8) to REAL(8) at (1) [-Wconversion]

	/home/jenkins/workspace/EinsteinToolkit/configs/sim/build/QuasiLocalMeasures/qlm_weyl_scalars1.f90:1126:34:

	

	qlm_phi02(i,j,hn) = qlm_phi02(i,j,hn) - 1/two * ri4(a,b) * mm(a) * mm(b)

	1

	Warning: Possible change of value in conversion from COMPLEX(8) to REAL(8) at (1) [-Wconversion]

	/home/jenkins/workspace/EinsteinToolkit/configs/sim/build/QuasiLocalMeasures/qlm_weyl_scalars1.f90:1128:34:

	

	qlm_phi20(i,j,hn) = qlm_phi20(i,j,hn) - 1/two * ri4(a,b) * conjg(mm(a)) * conjg(mm(b))

	1

	Warning: Possible change of value in conversion from COMPLEX(8) to REAL(8) at (1) [-Wconversion]

	COMPILING EinsteinAnalysis/QuasiLocalMeasures/src/qlm_3determinant.F90

	/home/jenkins/workspace/EinsteinToolkit/configs/sim/build/QuasiLocalMeasures/qlm_3determinant.f90:961:25:

	

	qlm_3det(i,j,hn)=a-2*CONJG(d)*d

	1

	Warning: Possible change of value in conversion from COMPLEX(8) to REAL(8) at (1) [-Wconversion]

	COMPILING EinsteinAnalysis/QuasiLocalMeasures/src/qlm_analyse.F90

	COMPILING EinsteinAnalysis/QuasiLocalMeasures/src/qlm_killing_normalise.F90

	Updating /home/jenkins/workspace/EinsteinToolkit/configs/sim/lib/libthorn_WeylScal4.a

	COMPILING EinsteinAnalysis/QuasiLocalMeasures/src/qlm_killing_transport.F90

	Checking status of thorn Cactus

	Updating /home/jenkins/workspace/EinsteinToolkit/configs/sim/lib/libthorn_QuasiLocalMeasures.a

	tar: arrangements/ExternalLibraries/LAPACK/dist/lapack-3.4.2.tgz: Cannot stat: No such file or directory

	tar: Exiting with failure status due to previous errors

	/home/jenkins/workspace/EinsteinToolkit/arrangements/CactusUtils/Formaline/src/make.configuration.deps:271: recipe for target '/home/jenkins/workspace/EinsteinToolkit/configs/sim/scratch/Formaline/thorn-LAPACK.c' failed

	make[1]: *** [/home/jenkins/workspace/EinsteinToolkit/configs/sim/scratch/Formaline/thorn-LAPACK.c] Error 1

	make[1]: *** Waiting for unfinished jobs....

	Makefile:260: recipe for target 'sim' failed

	make: *** [sim] Error 2

	Build step 'Execute shell' marked build as failure

	Archiving artifacts

	Recording test results

	ERROR: Step ?Publish JUnit test result report? failed: Test reports were found but none of them are new. Did leafNodes run?

	For example, /home/jenkins/workspace/EinsteinToolkit/testresults.xml is 19 days old

	

	IRC notifier plugin: Sending notification to: #cactus

	IRC notifier plugin: [ERROR] not connected. Cannot send message to '#cactus'

	Started calculate disk usage of build

	Finished Calculation of disk usage of build in 0 seconds

	Started calculate disk usage of workspace

	Finished Calculation of disk usage of workspace in  35 second

	Email was triggered for: Failure - 1st

	Email was triggered for: Failure - Any

	Trigger Failure - Any was overridden by another trigger and will not send an email.

	Trigger Failure - Still was overridden by another trigger and will not send an email.

	Sending email for trigger: Failure - 1st