BUILD FAILURE

Build URL:https://build-test.barrywardell.net/job/EinsteinToolkit/1399/
Project:EinsteinToolkit
Date of build:Sat, 30 Mar 2019 03:15:24 +0000
Build duration:33 sec

Changes

Revision: 2729d32dace567cbbed0c087be6b2cbda4007a85
Author:Roland Haas
Log:
Updated submodules


Artifacts

  • doc/HTML.tar.gz

  • Console Output

    
    	[...truncated 23 B...]
    
    	Started by an SCM change
    
    	[EnvInject] - Loading node environment variables.
    
    	Building remotely on ncsa (slave large) in workspace /home/jenkins/workspace/EinsteinToolkit
    
    	> git rev-parse --is-inside-work-tree # timeout=10
    
    	Fetching changes from the remote Git repository
    
    	> git config remote.origin.url https://bitbucket.org/einsteintoolkit/einsteintoolkit.git # timeout=10
    
    	Fetching upstream changes from https://bitbucket.org/einsteintoolkit/einsteintoolkit.git
    
    	> git --version # timeout=10
    
    	> git fetch --tags --progress https://bitbucket.org/einsteintoolkit/einsteintoolkit.git +refs/heads/*:refs/remotes/origin/*
    
    	> git rev-parse origin/master^{commit} # timeout=10
    
    	Checking out Revision 2729d32dace567cbbed0c087be6b2cbda4007a85 (origin/master)
    
    	Commit message: "Updated submodules"
    
    	> git config core.sparsecheckout # timeout=10
    
    	> git checkout -f 2729d32dace567cbbed0c087be6b2cbda4007a85
    
    	> git rev-list a23622e029ae288c5b0665832fff47fc8b6472c0 # timeout=10
    
    	> git tag -a -f -m Jenkins Build #1399 jenkins-EinsteinToolkit-1399 # timeout=10
    
    	No emails were triggered.
    
    	IRC notifier plugin: [ERROR] not connected. Cannot send message to '#cactus'
    
    	[EinsteinToolkit] $ /bin/bash /tmp/jenkins7958891806854346948.sh
    
    	Synchronizing submodule url for 'arrangements/CTThorns'
    
    	Synchronizing submodule url for 'arrangements/CactusBase'
    
    	Synchronizing submodule url for 'arrangements/CactusConnect'
    
    	Synchronizing submodule url for 'arrangements/CactusDoc/CoreDoc'
    
    	Synchronizing submodule url for 'arrangements/CactusElliptic'
    
    	Synchronizing submodule url for 'arrangements/CactusExamples'
    
    	Synchronizing submodule url for 'arrangements/CactusIO'
    
    	Synchronizing submodule url for 'arrangements/CactusNumerical'
    
    	Synchronizing submodule url for 'arrangements/CactusPUGH'
    
    	Synchronizing submodule url for 'arrangements/CactusPUGHIO'
    
    	Synchronizing submodule url for 'arrangements/CactusTest'
    
    	Synchronizing submodule url for 'arrangements/CactusUtils'
    
    	Synchronizing submodule url for 'arrangements/CactusWave'
    
    	Synchronizing submodule url for 'arrangements/EinsteinAnalysis'
    
    	Synchronizing submodule url for 'arrangements/EinsteinBase'
    
    	Synchronizing submodule url for 'arrangements/EinsteinEOS'
    
    	Synchronizing submodule url for 'arrangements/EinsteinEvolve'
    
    	Synchronizing submodule url for 'arrangements/EinsteinExamples'
    
    	Synchronizing submodule url for 'arrangements/EinsteinInitialData'
    
    	Synchronizing submodule url for 'arrangements/EinsteinUtils'
    
    	Synchronizing submodule url for 'arrangements/ExternalLibraries/BLAS'
    
    	Synchronizing submodule url for 'arrangements/ExternalLibraries/FFTW3'
    
    	Synchronizing submodule url for 'arrangements/ExternalLibraries/GSL'
    
    	Synchronizing submodule url for 'arrangements/ExternalLibraries/HDF5'
    
    	Synchronizing submodule url for 'arrangements/ExternalLibraries/LAPACK'
    
    	Synchronizing submodule url for 'arrangements/ExternalLibraries/LORENE'
    
    	Synchronizing submodule url for 'arrangements/ExternalLibraries/MPI'
    
    	Synchronizing submodule url for 'arrangements/ExternalLibraries/OpenBLAS'
    
    	Synchronizing submodule url for 'arrangements/ExternalLibraries/OpenCL'
    
    	Synchronizing submodule url for 'arrangements/ExternalLibraries/OpenSSL'
    
    	Synchronizing submodule url for 'arrangements/ExternalLibraries/PAPI'
    
    	Synchronizing submodule url for 'arrangements/ExternalLibraries/PETSc'
    
    	Synchronizing submodule url for 'arrangements/ExternalLibraries/hwloc'
    
    	Synchronizing submodule url for 'arrangements/ExternalLibraries/libjpeg'
    
    	Synchronizing submodule url for 'arrangements/ExternalLibraries/pciutils'
    
    	Synchronizing submodule url for 'arrangements/ExternalLibraries/pthreads'
    
    	Synchronizing submodule url for 'arrangements/ExternalLibraries/zlib'
    
    	Synchronizing submodule url for 'arrangements/Lean'
    
    	Synchronizing submodule url for 'arrangements/Llama'
    
    	Synchronizing submodule url for 'arrangements/Numerical'
    
    	Synchronizing submodule url for 'arrangements/PITTNullCode'
    
    	Synchronizing submodule url for 'arrangements/Proca'
    
    	Synchronizing submodule url for 'arrangements/WVUThorns'
    
    	Synchronizing submodule url for 'arrangements/WVUThorns_Diagnostics'
    
    	Synchronizing submodule url for 'flesh'
    
    	Synchronizing submodule url for 'manifest'
    
    	Synchronizing submodule url for 'repos/CRL'
    
    	Synchronizing submodule url for 'repos/EinsteinExact'
    
    	Synchronizing submodule url for 'repos/Kranc'
    
    	Synchronizing submodule url for 'repos/McLachlan'
    
    	Synchronizing submodule url for 'repos/carpet'
    
    	Synchronizing submodule url for 'simfactory'
    
    	Synchronizing submodule url for 'utils'
    
    	error: Your local changes to the following files would be overwritten by checkout:
    
    	doc/MaintGuide.pdf
    
    	doc/ReferenceManual.pdf
    
    	doc/UsersGuide.pdf
    
    	Please, commit your changes or stash them before you can switch branches.
    
    	Aborting
    
    	Unable to checkout 'cd184cad28ab03edc964d454c9ae7e541dedb27f' in submodule path 'flesh'
    
    	Build step 'Execute shell' marked build as failure
    
    	Archiving artifacts
    
    	Recording test results
    
    	ERROR: Step ?Publish JUnit test result report? failed: Test reports were found but none of them are new. Did tests run?
    
    	For example, /home/jenkins/workspace/EinsteinToolkit/testresults.xml is 1 day 3 hr old
    
    	
    
    	IRC notifier plugin: Sending notification to: #cactus
    
    	IRC notifier plugin: [ERROR] not connected. Cannot send message to '#cactus'
    
    	[BFA] Scanning build for known causes...
    
    	[BFA] No failure causes found
    
    	[BFA] Done. 0s
    
    	Started calculate disk usage of build
    
    	Finished Calculation of disk usage of build in 0 seconds
    
    	Started calculate disk usage of workspace
    
    	Finished Calculation of disk usage of workspace in  8 second
    
    	Email was triggered for: Failure - 1st
    
    	Email was triggered for: Failure - Any
    
    	Trigger Failure - Any was overridden by another trigger and will not send an email.
    
    	Trigger Failure - Still was overridden by another trigger and will not send an email.
    
    	Sending email for trigger: Failure - 1st