BUILD FAILURE

Build URL:https://build.barrywardell.net/job/EinsteinToolkit/788/
Project:EinsteinToolkit
Date of build:Sun, 29 May 2016 16:20:15 +0000
Build duration:9 min 54 sec

Changes

Revision: 70cffa8cee7137bef2af6a29a11a8081b69ecdd4
Author:Einstein Toolkit Git Server
Log:
Updated submodules:

* simfactory a7cc75b...2be1f31 (1):
  > Update Zwicky


Console Output


	[...truncated 2533 lines...]

	Creating cactus_sim in /home/jenkins/workspace/EinsteinToolkit/exe from EinsteinAnalysis/ADMAnalysis EinsteinBase/ADMBase EinsteinBase/ADMCoupling EinsteinBase/ADMMacros EinsteinAnalysis/ADMMass Numerical/AEILocalInterp EinsteinAnalysis/AHFinder EinsteinAnalysis/AHFinderDirect ExternalLibraries/BLAS CactusBase/Boundary CTThorns/CT_Analytic CTThorns/CT_MultiLevel EinsteinAnalysis/CalcK Carpet/Carpet Carpet/CarpetEvolutionMask Carpet/CarpetIOASCII Carpet/CarpetIOBasic Carpet/CarpetIOHDF5 Carpet/CarpetIOScalar Carpet/CarpetIntegrateTest Carpet/CarpetInterp Carpet/CarpetInterp2 Carpet/CarpetLib Carpet/CarpetMask Carpet/CarpetProlongateTest Carpet/CarpetReduce Carpet/CarpetRegrid Carpet/CarpetRegrid2 Carpet/CarpetRegridTest Carpet/CarpetSlab Carpet/CarpetTracker CactusBase/CartGrid3D CactusNumerical/Cartoon2D EinsteinBase/Constants WVUThorns/Convert_to_HydroBase CactusBase/CoordBase EinsteinBase/CoordGauge Carpet/CycleClock CactusExamples/DemoInterp CactusNumerical/Dissipation EinsteinInitialData/DistortedBHIVP EinsteinAnalysis/EHFinder EinsteinBase/EOS_Base EinsteinEOS/EOS_Hybrid EinsteinEOS/EOS_IdealFluid EinsteinEOS/EOS_Omni EinsteinEOS/EOS_Polytrope EinsteinExact/EinsteinExact_Test CactusElliptic/EllBase CactusElliptic/EllPETSc CactusElliptic/EllSOR EinsteinInitialData/Exact EinsteinAnalysis/Extract ExternalLibraries/FFTW3 CactusExamples/FleshInfo CactusUtils/Formaline CactusBase/Fortran EinsteinEvolve/GRHydro EinsteinEvolve/GRHydro_InitData ExternalLibraries/GSL EinsteinExact/GaugeWave KrancNumericalTools/GenericFD ExternalLibraries/HDF5 CactusConnect/HTTPD CactusConnect/HTTPDExtra CactusExamples/HelloWorld Carpet/HighOrderWaveTest EinsteinBase/HydroBase EinsteinAnalysis/Hydro_Analysis EinsteinInitialData/Hydro_InitExcision EinsteinInitialData/IDAnalyticBH EinsteinInitialData/IDAxiBrillBH EinsteinInitialData/IDAxiOddBrillBH EinsteinInitialData/IDBrillData EinsteinInitialData/IDConstraintViolate EinsteinInitialData/IDFileADM EinsteinInitialData/IDLinearWaves CactusWave/IDScalarWave CactusWave/IDScalarWaveC CactusWave/IDScalarWaveCXX CactusWave/IDScalarWaveElliptic CactusExamples/IDWaveMoL WVUThorns/ID_converter_ILGRMHD CactusBase/IOASCII CactusBase/IOBasic CactusPUGHIO/IOHDF5 CactusPUGHIO/IOHDF5Util CactusIO/IOJpeg CactusBase/IOUtil WVUThorns/IllinoisGRMHD CactusBase/InitBase CactusNumerical/InterpToArray EinsteinExact/KerrSchild ExternalLibraries/LAPACK ExternalLibraries/LORENE CactusNumerical/LocalInterp CactusNumerical/LocalInterp2 CactusNumerical/LocalReduce Carpet/LoopControl McLachlan/ML_ADMConstraints McLachlan/ML_ADMQuantities McLachlan/ML_BSSN McLachlan/ML_BSSN_Helper McLachlan/ML_BSSN_Test McLachlan/ML_CCZ4 McLachlan/ML_CCZ4_Helper McLachlan/ML_CCZ4_Test McLachlan/ML_WaveToy McLachlan/ML_WaveToy_Test ExternalLibraries/MPI CactusUtils/MemSpeed EinsteinInitialData/Meudon_Bin_BH EinsteinInitialData/Meudon_Bin_NS EinsteinInitialData/Meudon_Mag_NS EinsteinExact/Minkowski CactusNumerical/MoL EinsteinExact/ModifiedSchwarzschildBL EinsteinAnalysis/Multipole CactusUtils/NaNCatcher CactusUtils/NaNChecker EinsteinEvolve/NewRad CactusUtils/Nice EinsteinInitialData/NoExcision CactusUtils/NoMPI CactusNumerical/Noise CactusNumerical/Norms PITTNullCode/NullConstr PITTNullCode/NullDecomp PITTNullCode/NullEvolve PITTNullCode/NullExact PITTNullCode/NullGrid PITTNullCode/NullInterp PITTNullCode/NullNews PITTNullCode/NullPsiInt PITTNullCode/NullSHRExtract PITTNullCode/NullVars ExternalLibraries/OpenSSL EinsteinAnalysis/Outflow ExternalLibraries/PAPI ExternalLibraries/PETSc CactusPUGH/PUGH CactusPUGH/PUGHInterp CactusPUGH/PUGHReduce CactusPUGH/PUGHSlab CactusNumerical/Periodic Carpet/PeriodicCarpet CactusExamples/Poisson EinsteinAnalysis/PunctureTracker EinsteinAnalysis/QuasiLocalMeasures Carpet/ReductionTest Carpet/ReductionTest2 Carpet/ReductionTest3 CactusNumerical/ReflectionSymmetry Carpet/RegridSyncTest EinsteinInitialData/RotatingDBHIVP CactusNumerical/RotatingSymmetry180 CactusNumerical/RotatingSymmetry90 CactusExamples/SampleBoundary CactusExamples/SampleIO WVUThorns/Seed_Magnetic_Fields EinsteinUtils/SetMask_SphericalSurface EinsteinExact/ShiftedGaugeWave CactusNumerical/Slab CactusNumerical/SlabTest CactusConnect/Socket CactusNumerical/SpaceMask PITTNullCode/SphericalHarmonicDecomp PITTNullCode/SphericalHarmonicRecon PITTNullCode/SphericalHarmonicReconGen CactusNumerical/SphericalSurface EinsteinBase/StaticConformal CactusNumerical/SummationByParts CactusBase/SymBase CactusUtils/SystemStatistics CactusUtils/SystemTopology CactusElliptic/TATelliptic EinsteinUtils/TGRtensor EinsteinInitialData/TOVSolver CactusUtils/TerminationTrigger CactusTest/TestArrays Carpet/TestCarpetGridInfo CactusTest/TestComplex CactusTest/TestCoordinates CactusTest/TestFortranCrayPointers CactusTest/TestFortranDependencies1 CactusTest/TestFortranDependencies2 CactusTest/TestFpointerNULL CactusTest/TestFreeF90 CactusTest/TestGlobalReduce CactusTest/TestInclude1 CactusTest/TestInclude2 CactusNumerical/TestLocalInterp2 CactusNumerical/TestLocalReduce CactusTest/TestLoop Carpet/TestLoopControl CactusTest/TestMath CactusTest/TestMoL CactusTest/TestPar CactusTest/TestReduce CactusTest/TestSchedule CactusTest/TestStrings CactusTest/TestTable CactusTest/TestTimers CactusTest/TestTypes CactusBase/Time CactusExamples/TimerInfo CactusUtils/TimerReport Carpet/Timers EinsteinBase/TmunuBase CactusUtils/Trigger EinsteinInitialData/TwoPunctures EinsteinExact/Vaidya2 CactusUtils/Vectors CactusUtils/WatchDog CactusWave/WaveBinarySource CactusExamples/WaveMoL CactusExamples/WaveToy1DF77 CactusExamples/WaveToy2DF77 CactusWave/WaveToyC CactusWave/WaveToyCXX CactusWave/WaveToyExtra CactusWave/WaveToyF77 CactusWave/WaveToyF90 CactusWave/WaveToyFreeF90 EinsteinAnalysis/WeylScal4 ExternalLibraries/hwloc ExternalLibraries/libjpeg ExternalLibraries/pthreads ExternalLibraries/zlib

	Formaline: Committing source tree to git repository...

	Formaline: Created git tag build-sim-caltechcactusjenkins.spdns.org-jenkins-2016.05.29-16.23.00-10215

	Formaline: Updated git branch config-sim-caltechcactusjenkins.spdns.org-home-jenkins-workspace-EinsteinToolkit

	Formaline: Pushing to master git repository...

	Formaline: Pushing to local git repository /home/jenkins/workspace/EinsteinToolkit/../CactusSourceJar.git...

	Formaline: Done.

	Formaline: (Formaline has finished updating the git repositories.

	Formaline:  If the build process seems to hang, some other command

	Formaline:  is still running, e.g. the final link stage.)

	collect2: ld returned 1 exit status

	make[1]: *** [/home/jenkins/workspace/EinsteinToolkit/exe/cactus_sim] Error 1

	make: *** [sim] Error 2

	Traceback (most recent call last):

	File "simfactory/bin/../lib/sim.py", line 148, in <module>

	main()

	File "simfactory/bin/../lib/sim.py", line 144, in main

	CommandDispatch()

	File "simfactory/bin/../lib/sim.py", line 106, in CommandDispatch

	module.main()

	File "/home/jenkins/workspace/EinsteinToolkit/simfactory/lib/sim-build.py", line 456, in main

	CommandDispatch()

	File "/home/jenkins/workspace/EinsteinToolkit/simfactory/lib/sim-build.py", line 379, in CommandDispatch

	exec("command_%s()" % command)

	File "<string>", line 1, in <module>

	File "/home/jenkins/workspace/EinsteinToolkit/simfactory/lib/sim-build.py", line 428, in command_build

	BuildConfiguration(config)

	File "/home/jenkins/workspace/EinsteinToolkit/simfactory/lib/sim-build.py", line 330, in BuildConfiguration

	ret = simlib.ExecuteCommand("cd %s && %s %s 2>&1" % (simenv.CACTUS_PATH, make, configName))

	File "/home/jenkins/workspace/EinsteinToolkit/simfactory/lib/simlib.py", line 562, in ExecuteCommand

	dprint("Error while executing command \"%s\":" % command)

	File "/home/jenkins/workspace/EinsteinToolkit/simfactory/lib/libutil.py", line 61, in dprint

	log.flush()

	IOError: [Errno 30] Read-only file system

	FATAL: Unable to delete script file /tmp/hudson5046892513165866302.sh

	java.io.IOException: remote file operation failed: /tmp/hudson5046892513165866302.sh at hudson.remoting.Channel@39ac902e:AEI: java.nio.file.FileSystemException: /tmp/hudson5046892513165866302.sh: Read-only file system

	at hudson.FilePath.act(FilePath.java:986)

	at hudson.FilePath.act(FilePath.java:968)

	at hudson.FilePath.delete(FilePath.java:1422)

	at hudson.tasks.CommandInterpreter.perform(CommandInterpreter.java:104)

	at hudson.tasks.CommandInterpreter.perform(CommandInterpreter.java:64)

	at hudson.tasks.BuildStepMonitor$1.perform(BuildStepMonitor.java:20)

	at hudson.model.AbstractBuild$AbstractBuildExecution.perform(AbstractBuild.java:782)

	at hudson.model.Build$BuildExecution.build(Build.java:205)

	at hudson.model.Build$BuildExecution.doRun(Build.java:162)

	at hudson.model.AbstractBuild$AbstractBuildExecution.run(AbstractBuild.java:534)

	at hudson.model.Run.execute(Run.java:1738)

	at hudson.model.FreeStyleBuild.run(FreeStyleBuild.java:43)

	at hudson.model.ResourceController.execute(ResourceController.java:98)

	at hudson.model.Executor.run(Executor.java:410)

	Caused by: java.nio.file.FileSystemException: /tmp/hudson5046892513165866302.sh: Read-only file system

	at sun.nio.fs.UnixException.translateToIOException(UnixException.java:91)

	at sun.nio.fs.UnixException.rethrowAsIOException(UnixException.java:102)

	at sun.nio.fs.UnixException.rethrowAsIOException(UnixException.java:107)

	at sun.nio.fs.UnixFileSystemProvider.implDelete(UnixFileSystemProvider.java:244)

	at sun.nio.fs.AbstractFileSystemProvider.delete(AbstractFileSystemProvider.java:103)

	at java.nio.file.Files.delete(Files.java:1079)

	at sun.reflect.NativeMethodAccessorImpl.invoke0(Native Method)

	at sun.reflect.NativeMethodAccessorImpl.invoke(NativeMethodAccessorImpl.java:57)

	at sun.reflect.DelegatingMethodAccessorImpl.invoke(DelegatingMethodAccessorImpl.java:43)

	at java.lang.reflect.Method.invoke(Method.java:606)

	at hudson.Util.deleteFile(Util.java:255)

	at hudson.FilePath$19.invoke(FilePath.java:1425)

	at hudson.FilePath$19.invoke(FilePath.java:1422)

	at hudson.FilePath$FileCallableWrapper.call(FilePath.java:2719)

	at hudson.remoting.UserRequest.perform(UserRequest.java:120)

	at hudson.remoting.UserRequest.perform(UserRequest.java:48)

	at hudson.remoting.Request$2.run(Request.java:326)

	at hudson.remoting.InterceptingExecutorService$1.call(InterceptingExecutorService.java:68)

	at java.util.concurrent.FutureTask.run(FutureTask.java:262)

	at java.util.concurrent.ThreadPoolExecutor.runWorker(ThreadPoolExecutor.java:1145)

	at java.util.concurrent.ThreadPoolExecutor$Worker.run(ThreadPoolExecutor.java:615)

	at java.lang.Thread.run(Thread.java:745)

	at ......remote call to AEI(Native Method)

	at hudson.remoting.Channel.attachCallSiteStackTrace(Channel.java:1416)

	at hudson.remoting.UserResponse.retrieve(UserRequest.java:220)

	at hudson.remoting.Channel.call(Channel.java:781)

	at hudson.FilePath.act(FilePath.java:979)

	... 13 more

	Build step 'Execute shell' marked build as failure

	Archiving artifacts

	Recording test results

	ERROR: Step ‘Publish JUnit test result report’ failed: Test reports were found but none of them are new. Did tests run?

	For example, /home/jenkins/workspace/EinsteinToolkit/testresults.xml is 1 hr 56 min old

	

	IRC notifier plugin: Sending notification to: #cactus

	IRC notifier plugin: [ERROR] not connected. Cannot send message to '#cactus'

	[BFA] Scanning build for known causes...

	[BFA] No failure causes found

	[BFA] Done. 0s

	Started calculate disk usage of build

	Finished Calculation of disk usage of build in 0 seconds

	Started calculate disk usage of workspace

	Finished Calculation of disk usage of workspace in  13 second

	Email was triggered for: Failure - 1st

	Email was triggered for: Failure - Any

	Trigger Failure - Any was overridden by another trigger and will not send an email.

	Trigger Failure - Still was overridden by another trigger and will not send an email.

	Sending email for trigger: Failure - 1st