BUILD FAILURE

Build URL:https://build.barrywardell.net/job/EinsteinToolkit/1475/
Project:EinsteinToolkit
Date of build:Wed, 27 Nov 2019 22:05:21 +0000
Build duration:17 min

Changes

Revision: 03f83a75a412f2f7f8b18f98b06bb7425a2f18e7
Author:Einstein Toolkit Git Server
Log:
Updated submodules:

* repos/carpet 0634500...5e1af51 (1):
  > TestBBoxSet2: fix interface.ccl syntax
Revision: e92a00f04b7a3ed64d18828967fa3586adc06b75
Author:Einstein Toolkit Git Server
Log:
Updated submodules:

* arrangements/CactusUtils 2c7f53b...6efd070 (1):
  > TimerReport: allow arbirary long timer names


Artifacts

  • doc/HTML.tar.gz

  • Console Output

    
    	[...truncated 664.51 KB...]
    
    	/home/jenkins/workspace/EinsteinToolkit/configs/sim/build/QuasiLocalMeasures/qlm_multipoles.f90:902:20:
    
    	
    
    	COMPLEX*16 :: psi2
    
    	1
    
    	Warning: Unused variable 'psi2' declared at (1) [-Wunused-variable]
    
    	COMPILING EinsteinAnalysis/QuasiLocalMeasures/src/qlm_newman_penrose.F90
    
    	COMPILING EinsteinAnalysis/QuasiLocalMeasures/src/qlm_newman_penrose1.F90
    
    	COMPILING EinsteinAnalysis/QuasiLocalMeasures/src/qlm_output_vtk.F90
    
    	COMPILING EinsteinAnalysis/QuasiLocalMeasures/src/qlm_paramcheck.F90
    
    	/home/jenkins/workspace/EinsteinToolkit/configs/sim/build/QuasiLocalMeasures/qlm_paramcheck.f90:892:23:
    
    	
    
    	integer   :: eq_theta, new_ntheta, int_nphi, new_nphi
    
    	1
    
    	Warning: Unused variable 'eq_theta' declared at (1) [-Wunused-variable]
    
    	/home/jenkins/workspace/EinsteinToolkit/configs/sim/build/QuasiLocalMeasures/qlm_paramcheck.f90:892:45:
    
    	
    
    	integer   :: eq_theta, new_ntheta, int_nphi, new_nphi
    
    	1
    
    	Warning: Unused variable 'int_nphi' declared at (1) [-Wunused-variable]
    
    	/home/jenkins/workspace/EinsteinToolkit/configs/sim/build/QuasiLocalMeasures/qlm_paramcheck.f90:892:55:
    
    	
    
    	integer   :: eq_theta, new_ntheta, int_nphi, new_nphi
    
    	1
    
    	Warning: Unused variable 'new_nphi' declared at (1) [-Wunused-variable]
    
    	/home/jenkins/workspace/EinsteinToolkit/configs/sim/build/QuasiLocalMeasures/qlm_paramcheck.f90:892:35:
    
    	
    
    	integer   :: eq_theta, new_ntheta, int_nphi, new_nphi
    
    	1
    
    	Warning: Unused variable 'new_ntheta' declared at (1) [-Wunused-variable]
    
    	COMPILING EinsteinAnalysis/QuasiLocalMeasures/src/qlm_set_coordinates.F90
    
    	COMPILING EinsteinAnalysis/QuasiLocalMeasures/src/qlm_tetrad.F90
    
    	COMPILING EinsteinAnalysis/QuasiLocalMeasures/src/qlm_tetrad1.F90
    
    	COMPILING EinsteinAnalysis/QuasiLocalMeasures/src/qlm_twometric.F90
    
    	COMPILING EinsteinAnalysis/QuasiLocalMeasures/src/qlm_weyl_scalars.F90
    
    	COMPILING EinsteinAnalysis/QuasiLocalMeasures/src/qlm_weyl_scalars1.F90
    
    	/home/jenkins/workspace/EinsteinToolkit/configs/sim/build/QuasiLocalMeasures/qlm_weyl_scalars1.f90:1121:34:
    
    	
    
    	qlm_phi11(i,j,hn) = qlm_phi11(i,j,hn) - 1/two * ri4(a,b) * (ll(a) * nn(b) + mm(a) * conjg(mm(b))) / 2
    
    	1
    
    	Warning: Possible change of value in conversion from COMPLEX(8) to REAL(8) at (1) [-Wconversion]
    
    	/home/jenkins/workspace/EinsteinToolkit/configs/sim/build/QuasiLocalMeasures/qlm_weyl_scalars1.f90:1122:34:
    
    	
    
    	qlm_phi01(i,j,hn) = qlm_phi01(i,j,hn) - 1/two * ri4(a,b) * ll(a) * mm(b)
    
    	1
    
    	Warning: Possible change of value in conversion from COMPLEX(8) to REAL(8) at (1) [-Wconversion]
    
    	/home/jenkins/workspace/EinsteinToolkit/configs/sim/build/QuasiLocalMeasures/qlm_weyl_scalars1.f90:1123:34:
    
    	
    
    	qlm_phi12(i,j,hn) = qlm_phi12(i,j,hn) - 1/two * ri4(a,b) * nn(a) * mm(b)
    
    	1
    
    	Warning: Possible change of value in conversion from COMPLEX(8) to REAL(8) at (1) [-Wconversion]
    
    	/home/jenkins/workspace/EinsteinToolkit/configs/sim/build/QuasiLocalMeasures/qlm_weyl_scalars1.f90:1124:34:
    
    	
    
    	qlm_phi10(i,j,hn) = qlm_phi10(i,j,hn) - 1/two * ri4(a,b) * ll(a) * conjg(mm(b))
    
    	1
    
    	Warning: Possible change of value in conversion from COMPLEX(8) to REAL(8) at (1) [-Wconversion]
    
    	/home/jenkins/workspace/EinsteinToolkit/configs/sim/build/QuasiLocalMeasures/qlm_weyl_scalars1.f90:1125:34:
    
    	
    
    	qlm_phi21(i,j,hn) = qlm_phi21(i,j,hn) - 1/two * ri4(a,b) * nn(a) * conjg(mm(b))
    
    	1
    
    	Warning: Possible change of value in conversion from COMPLEX(8) to REAL(8) at (1) [-Wconversion]
    
    	/home/jenkins/workspace/EinsteinToolkit/configs/sim/build/QuasiLocalMeasures/qlm_weyl_scalars1.f90:1126:34:
    
    	
    
    	qlm_phi02(i,j,hn) = qlm_phi02(i,j,hn) - 1/two * ri4(a,b) * mm(a) * mm(b)
    
    	1
    
    	Warning: Possible change of value in conversion from COMPLEX(8) to REAL(8) at (1) [-Wconversion]
    
    	/home/jenkins/workspace/EinsteinToolkit/configs/sim/build/QuasiLocalMeasures/qlm_weyl_scalars1.f90:1128:34:
    
    	
    
    	qlm_phi20(i,j,hn) = qlm_phi20(i,j,hn) - 1/two * ri4(a,b) * conjg(mm(a)) * conjg(mm(b))
    
    	1
    
    	Warning: Possible change of value in conversion from COMPLEX(8) to REAL(8) at (1) [-Wconversion]
    
    	COMPILING EinsteinAnalysis/QuasiLocalMeasures/src/qlm_3determinant.F90
    
    	/home/jenkins/workspace/EinsteinToolkit/configs/sim/build/QuasiLocalMeasures/qlm_3determinant.f90:961:25:
    
    	
    
    	qlm_3det(i,j,hn)=a-2*CONJG(d)*d
    
    	1
    
    	Warning: Possible change of value in conversion from COMPLEX(8) to REAL(8) at (1) [-Wconversion]
    
    	COMPILING EinsteinAnalysis/QuasiLocalMeasures/src/qlm_analyse.F90
    
    	COMPILING EinsteinAnalysis/QuasiLocalMeasures/src/qlm_killing_normalise.F90
    
    	COMPILING EinsteinAnalysis/QuasiLocalMeasures/src/qlm_killing_transport.F90
    
    	Updating /home/jenkins/workspace/EinsteinToolkit/configs/sim/lib/libthorn_QuasiLocalMeasures.a
    
    	Makefile:256: recipe for target 'sim' failed
    
    	make: *** [sim] Error 2
    
    	Build step 'Execute shell' marked build as failure
    
    	Archiving artifacts
    
    	Recording test results
    
    	ERROR: Step ?Publish JUnit test result report? failed: Test reports were found but none of them are new. Did leafNodes run?
    
    	For example, /home/jenkins/workspace/EinsteinToolkit/testresults.xml is 4 hr 48 min old
    
    	
    
    	IRC notifier plugin: Sending notification to: #cactus
    
    	IRC notifier plugin: [ERROR] not connected. Cannot send message to '#cactus'
    
    	Started calculate disk usage of build
    
    	Finished Calculation of disk usage of build in 0 seconds
    
    	Started calculate disk usage of workspace
    
    	Finished Calculation of disk usage of workspace in  3 second
    
    	Email was triggered for: Failure - 1st
    
    	Email was triggered for: Failure - Any
    
    	Trigger Failure - Any was overridden by another trigger and will not send an email.
    
    	Trigger Failure - Still was overridden by another trigger and will not send an email.
    
    	Sending email for trigger: Failure - 1st