BUILD FAILURE

Build URL:https://build.barrywardell.net/job/EinsteinToolkit/798/
Project:EinsteinToolkit
Date of build:Tue, 07 Jun 2016 08:37:14 +0000
Build duration:48 sec

Changes

Revision: ace38c88cf3f148c693736d5881dfacb452b9d8f
Author:Einstein Toolkit Git Server
Log:
Updated submodules:

* arrangements/ExternalLibraries/PETSc 2e0fd61...8d71e4d (1):
  > move unset of ARFLAGS to later in detection


Console Output


	[...truncated 2743 lines...]

	use ./configure CXX=$CXX if you really want to use that value ******

	===============================================================================

	

	===============================================================================

	***** WARNING: CXXFLAGS (set to -g3 -march=native -std=gnu++0x -O2 -ffast-math -fopenmp -Wall) found in environment variables - ignoring

	use ./configure CXXFLAGS=$CXXFLAGS if you really want to use that value ******

	===============================================================================

	

	===============================================================================

	***** WARNING: F77 (set to gfortran) found in environment variables - ignoring

	use ./configure F77=$F77 if you really want to use that value ******

	===============================================================================

	

	===============================================================================

	***** WARNING: F90 (set to gfortran) found in environment variables - ignoring

	use ./configure F90=$F90 if you really want to use that value ******

	===============================================================================

	

	===============================================================================

	***** WARNING: F90FLAGS (set to -g3 -march=native -fcray-pointer -ffixed-line-length-none -fno-range-check -O2 -ffast-math -fopenmp -Wall) found in environment variables - ignoring

	use ./configure F90FLAGS=$F90FLAGS if you really want to use that value ******

	===============================================================================

	

	===============================================================================

	***** WARNING: CPP (set to cpp) found in environment variables - ignoring

	use ./configure CPP=$CPP if you really want to use that value ******

	===============================================================================

	

	===============================================================================

	***** WARNING: CPPFLAGS (set to -DMPICH_IGNORE_CXX_SEEK -DKRANC_VECTORS -fopenmp -Wall) found in environment variables - ignoring

	use ./configure CPPFLAGS=$CPPFLAGS if you really want to use that value ******

	===============================================================================

	

	===============================================================================

	***** WARNING: LDFLAGS (set to -rdynamic) found in environment variables - ignoring

	use ./configure LDFLAGS=$LDFLAGS if you really want to use that value ******

	===============================================================================

	

	===============================================================================

	***** WARNING: MPI_DIR (set to /usr) found in environment variables - ignoring

	use ./configure MPI_DIR=$MPI_DIR if you really want to use that value ******

	===============================================================================

	

	===============================================================================

	***** WARNING: MAKEFLAGS (set to s --jobserver-fds=4,5 -j -- CCTK_TARGET=make.checked CCTK_HOME=/home/jenkins/workspace/EinsteinToolkit TOP=/home/jenkins/workspace/EinsteinToolkit/configs/sim SRCDIR=/home/jenkins/workspace/EinsteinToolkit/arrangements/ExternalLibraries/PETSc/src CONFIG=/home/jenkins/workspace/EinsteinToolkit/configs/sim/config-data NAME=/home/jenkins/workspace/EinsteinToolkit/configs/sim/lib/libthorn_PETSc.a THORN=PETSc USESTHORNS=BLAS\ LAPACK\ MPI) found in environment variables - ignoring

	use ./configure MAKEFLAGS=$MAKEFLAGS if you really want to use that value ******

	===============================================================================

	

	===============================================================================

	***** WARNING: AR (set to ar) found in environment variables - ignoring

	use ./configure AR=$AR if you really want to use that value ******

	===============================================================================

	

	TESTING: checkMPICompilerOverride from config.setCompilers(/home/jenkins/workspace/EinsteinToolkit/configs/sim/scratch/build/PETSc/petsc-3.5.2/config/BuildSystem/config/setCompilers.py:1501)

	TESTING: requireMpiLdPath from config.setCompilers(/home/jenkins/workspace/EinsteinToolkit/configs/sim/scratch/build/PETSc/petsc-3.5.2/config/BuildSystem/config/setCompilers.py:1520)

	TESTING: checkVendor from config.setCompilers(/home/jenkins/workspace/EinsteinToolkit/configs/sim/scratch/build/PETSc/petsc-3.5.2/config/BuildSystem/config/setCompilers.py:398)

	TESTING: checkInitialFlags from config.setCompilers(/home/jenkins/workspace/EinsteinToolkit/configs/sim/scratch/build/PETSc/petsc-3.5.2/config/BuildSystem/config/setCompilers.py:408)

	TESTING: checkCCompiler from config.setCompilers(/home/jenkins/workspace/EinsteinToolkit/configs/sim/scratch/build/PETSc/petsc-3.5.2/config/BuildSystem/config/setCompilers.py:534)Checking status of thorn ML_WaveToy

	

	TESTING: checkCPreprocessor from config.setCompilers(/home/jenkins/workspace/EinsteinToolkit/configs/sim/scratch/build/PETSc/petsc-3.5.2/config/BuildSystem/config/setCompilers.py:568)

	TESTING: checkCUDACompiler from config.setCompilers(/home/jenkins/workspace/EinsteinToolkit/configs/sim/scratch/build/PETSc/petsc-3.5.2/config/BuildSystem/config/setCompilers.py:602)

	TESTING: checkCUDAPreprocessor from config.setCompilers(/home/jenkins/workspace/EinsteinToolkit/configs/sim/scratch/build/PETSc/petsc-3.5.2/config/BuildSystem/config/setCompilers.py:642)

	TESTING: checkCxxCompiler from config.setCompilers(/home/jenkins/workspace/EinsteinToolkit/configs/sim/scratch/build/PETSc/petsc-3.5.2/config/BuildSystem/config/setCompilers.py:754)Checking status of thorn MemSpeed

	Checking status of thorn Minkowski

	

	TESTING: checkCxxPreprocessor from config.setCompilers(/home/jenkins/workspace/EinsteinToolkit/configs/sim/scratch/build/PETSc/petsc-3.5.2/config/BuildSystem/config/setCompilers.py:793)

	TESTING: checkFortranCompiler from config.setCompilers(/home/jenkins/workspace/EinsteinToolkit/configs/sim/scratch/build/PETSc/petsc-3.5.2/config/BuildSystem/config/setCompilers.py:910)

	TESTING: checkPIC from config.setCompilers(/home/jenkins/workspace/EinsteinToolkit/configs/sim/scratch/build/PETSc/petsc-3.5.2/config/BuildSystem/config/setCompilers.py:994)

	TESTING: checkLargeFileIO from config.setCompilers(/home/jenkins/workspace/EinsteinToolkit/configs/sim/scratch/build/PETSc/petsc-3.5.2/config/BuildSystem/config/setCompilers.py:1027)

	TESTING: checkArchiver from config.setCompilers(/home/jenkins/workspace/EinsteinToolkit/configs/sim/scratch/build/PETSc/petsc-3.5.2/config/BuildSystem/config/setCompilers.py:1126)Checking status of thorn ModifiedSchwarzschildBL

	

	*******************************************************************************

	UNABLE to CONFIGURE with GIVEN OPTIONS    (see configure.log for details):

	-------------------------------------------------------------------------------

	You set a value for --with-ar=ar", but ar cannot be used

	*******************************************************************************

	

	make[3]: *** [/home/jenkins/workspace/EinsteinToolkit/configs/sim/scratch/done/PETSc] Error 1

	make[2]: *** [make.checked] Error 2

	make[1]: *** [/home/jenkins/workspace/EinsteinToolkit/configs/sim/lib/libthorn_PETSc.a] Error 2

	make[1]: *** Waiting for unfinished jobs....

	make: *** [sim] Error 2

	Build step 'Execute shell' marked build as failure

	Archiving artifacts

	Recording test results

	ERROR: Step ‘Publish JUnit test result report’ failed: Test reports were found but none of them are new. Did tests run?

	For example, /home/jenkins/workspace/EinsteinToolkit/testresults.xml is 7 days 14 hr old

	

	IRC notifier plugin: Sending notification to: #cactus

	IRC notifier plugin: [ERROR] not connected. Cannot send message to '#cactus'

	[BFA] Scanning build for known causes...

	[BFA] No failure causes found

	[BFA] Done. 0s

	Started calculate disk usage of build

	Finished Calculation of disk usage of build in 0 seconds

	Started calculate disk usage of workspace

	Finished Calculation of disk usage of workspace in  4 second

	Email was triggered for: Failure - Any

	Sending email for trigger: Failure - Any