BUILD FAILURE

Build URL:https://build.barrywardell.net/job/EinsteinToolkit/1711/
Project:EinsteinToolkit
Date of build:Sun, 16 Aug 2020 18:41:56 +0000
Build duration:20 min

Changes

Revision: 51a05b8ca5c963713f1bcd4c61fbdcd0a5fd17b9
Author:Roland Haas
Log:
updated submodules

Submodule arrangements/CactusBase f54e0f4..6ddc175:
  > Fortran: record max allowed subroutine lengths in comment
Submodule arrangements/CactusUtils f13cf83..78427d5:
  > Vectors: correct VSX loadu, storeu and ksgn functions
Submodule flesh 1e362da..a0db45d:
  > Cactus: Rename macro to CCTK_LOOP_DISABLE_PRAGMA_OMP
  > Merged in eschnett/loop-no-openmp (pull request #102)
Submodule repos/CRL ccc00de..9bebdea:
  > GetComponents: support curl to download initial thornlist
Submodule simfactory 7314ce0..ef37f3f:
  > summit: use mcpu=power9 rather than default power9
  > summit: enable vectorization


Console Output


	[...truncated 725.62 KB...]

	4801 |   subroutine  point_v1sym(lsh, vsize, i_min, i_max, gf_n, gf_s, v1sym)

	|

	Warning: 'point_v1sym' defined but not used [-Wunused-function]

	/home/jenkins/workspace/EinsteinToolkit/configs/sim/build/NullSHRExtract/NullSHRE_Pointing.f90:4824:0:

	

	4824 |   subroutine  point_v2(lsh, vsize, i_min, i_max, j_min, j_max, gf_n, gf_s, v2)

	|

	Warning: 'point_v2' defined but not used [-Wunused-function]

	/home/jenkins/workspace/EinsteinToolkit/configs/sim/build/NullSHRExtract/NullSHRE_Pointing.f90:4870:0:

	

	4870 |   subroutine  point_v3_sym12(lsh, vsize, i_min, i_max, k_min, k_max, gf_n, gf_s, v3_sym12)

	|

	Warning: 'point_v3_sym12' defined but not used [-Wunused-function]

	/home/jenkins/workspace/EinsteinToolkit/configs/sim/build/NullSHRExtract/NullSHRE_Pointing.f90:4897:0:

	

	4897 |   subroutine  point_v3_sym23(lsh, vsize, i_min, i_max, j_min, j_max, gf_n, gf_s, v3_sym23)

	|

	Warning: 'point_v3_sym23' defined but not used [-Wunused-function]

	/home/jenkins/workspace/EinsteinToolkit/configs/sim/build/NullSHRExtract/NullSHRE_Pointing.f90:2979:0:

	

	2979 |   subroutine  point_v1sym(lsh, vsize, i_min, i_max, gf_n, gf_s, v1sym)

	|

	Warning: 'point_v1sym' defined but not used [-Wunused-function]

	/home/jenkins/workspace/EinsteinToolkit/configs/sim/build/NullSHRExtract/NullSHRE_Pointing.f90:3002:0:

	

	3002 |   subroutine  point_v2(lsh, vsize, i_min, i_max, j_min, j_max, gf_n, gf_s, v2)

	|

	Warning: 'point_v2' defined but not used [-Wunused-function]

	/home/jenkins/workspace/EinsteinToolkit/configs/sim/build/NullSHRExtract/NullSHRE_Pointing.f90:3048:0:

	

	3048 |   subroutine  point_v3_sym12(lsh, vsize, i_min, i_max, k_min, k_max, gf_n, gf_s, v3_sym12)

	|

	Warning: 'point_v3_sym12' defined but not used [-Wunused-function]

	/home/jenkins/workspace/EinsteinToolkit/configs/sim/build/NullSHRExtract/NullSHRE_Pointing.f90:3075:0:

	

	3075 |   subroutine  point_v3_sym23(lsh, vsize, i_min, i_max, j_min, j_max, gf_n, gf_s, v3_sym23)

	|

	Warning: 'point_v3_sym23' defined but not used [-Wunused-function]

	COMPILING McLachlan/ML_CCZ4/src/ML_CCZ4_EvolutionBoundaryScalar.cc

	COMPILING McLachlan/ML_CCZ4/src/ML_CCZ4_EvolutionInterior.cc

	COMPILING PITTNullCode/NullSHRExtract/src/NullSHRE_SchReadClm.F90

	COMPILING PITTNullCode/NullSHRExtract/src/NullSHRE_SchPreCalc.F90

	COMPILING PITTNullCode/NullSHRExtract/src/NullSHRE_ExtractWT.F90

	COMPILING PITTNullCode/NullSHRExtract/src/NullSHRE_InitialWT.F90

	Updating /home/jenkins/workspace/EinsteinToolkit/configs/sim/lib/libthorn_NullSHRExtract.a

	Checking status of thorn PUGHInterp

	COMPILING CactusPUGH/PUGHInterp/src/Startup.c

	COMPILING CactusPUGH/PUGHInterp/src/InterpGridArrays.c

	Updating /home/jenkins/workspace/EinsteinToolkit/configs/sim/lib/libthorn_PUGHInterp.a

	COMPILING McLachlan/ML_CCZ4/src/ML_CCZ4_EvolutionInteriorSplitBy1.cc

	

	cc1plus: out of memory allocating 193494184 bytes after a total of 329596928 bytes

	make[3]: *** [/home/jenkins/workspace/EinsteinToolkit/configs/sim/config-data/make.config.rules:281: ML_CCZ4_EvolutionInterior.cc.o] Error 1

	make[3]: *** Waiting for unfinished jobs....

	Checking status of thorn PUGHReduce

	COMPILING CactusPUGH/PUGHReduce/src/ReductionAvg.c

	COMPILING CactusPUGH/PUGHReduce/src/ReductionCount.c

	COMPILING CactusPUGH/PUGHReduce/src/ReductionMax.c

	make[2]: *** [/home/jenkins/workspace/EinsteinToolkit/lib/make/make.thornlib:113: make.checked] Error 2

	make[1]: *** [/home/jenkins/workspace/EinsteinToolkit/lib/make/make.configuration:179: /home/jenkins/workspace/EinsteinToolkit/configs/sim/lib/libthorn_ML_CCZ4.a] Error 2

	make[1]: *** Waiting for unfinished jobs....

	COMPILING CactusPUGH/PUGHReduce/src/ReductionMin.c

	COMPILING CactusPUGH/PUGHReduce/src/ReductionNorm1.c

	COMPILING CactusPUGH/PUGHReduce/src/ReductionNorm2.c

	COMPILING CactusPUGH/PUGHReduce/src/ReductionNorm3.c

	COMPILING CactusPUGH/PUGHReduce/src/ReductionNorm4.c

	COMPILING CactusPUGH/PUGHReduce/src/ReductionNormInf.c

	COMPILING CactusPUGH/PUGHReduce/src/ReductionSum.c

	COMPILING CactusPUGH/PUGHReduce/src/Startup.c

	COMPILING CactusPUGH/PUGHReduce/src/Reduction.c

	COMPILING CactusPUGH/PUGHReduce/src/ReduceGA.c

	COMPILING CactusPUGH/PUGHReduce/src/ReduceArraysGlobally.c

	Updating /home/jenkins/workspace/EinsteinToolkit/configs/sim/lib/libthorn_PUGHReduce.a

	make: *** [Makefile:264: sim] Error 2

	

	real	19m45.845s

	user	32m54.060s

	sys	1m22.012s

	

	real	19m47.047s

	user	32m54.740s

	sys	1m22.076s

	Build step 'Execute shell' marked build as failure

	Archiving artifacts

	Recording test results

	ERROR: Step ?Publish JUnit test result report? failed: Test reports were found but none of them are new. Did leafNodes run?

	For example, /home/jenkins/workspace/EinsteinToolkit/testresults.xml is 16 days old

	

	IRC notifier plugin: Sending notification to: #cactus

	IRC notifier plugin: [ERROR] not connected. Cannot send message to '#cactus'

	Started calculate disk usage of build

	Finished Calculation of disk usage of build in 0 seconds

	Started calculate disk usage of workspace

	Finished Calculation of disk usage of workspace in  5 second

	Email was triggered for: Failure - 1st

	Email was triggered for: Failure - Any

	Trigger Failure - Any was overridden by another trigger and will not send an email.

	Trigger Failure - Still was overridden by another trigger and will not send an email.

	Sending email for trigger: Failure - 1st