BUILD FAILURE

Build URL:https://build.barrywardell.net/job/EinsteinToolkit/713/
Project:EinsteinToolkit
Date of build:Thu, 31 Mar 2016 08:40:04 +0000
Build duration:3 min 34 sec

Changes

No changes


Console Output


	[...truncated 118 lines...]

	Submodule path 'arrangements/CactusWave': checked out '7dfe5085733fa987e8252313fc992fc667d0ea41'

	Cloning into 'arrangements/EinsteinAnalysis'...

	Submodule path 'arrangements/EinsteinAnalysis': checked out '6b4bd6fba13b9b38a983f7702469fd59e24b5a01'

	Cloning into 'arrangements/EinsteinBase'...

	Submodule path 'arrangements/EinsteinBase': checked out '7e3657a0f6b7966976e0111f6cd5d11e499b5e8b'

	Cloning into 'arrangements/EinsteinEOS'...

	Submodule path 'arrangements/EinsteinEOS': checked out 'bfc2378746dbd4b366527d74e7d9785579cb8ed7'

	Cloning into 'arrangements/EinsteinEvolve'...

	Submodule path 'arrangements/EinsteinEvolve': checked out 'd09b759938e9cdb0fd24b6346c9d34fe0aa0c814'

	Cloning into 'arrangements/EinsteinExamples'...

	Submodule path 'arrangements/EinsteinExamples': checked out '10b6045a03d177180920c6dbbb2d2ac4efaee305'

	Cloning into 'arrangements/EinsteinInitialData'...

	Submodule path 'arrangements/EinsteinInitialData': checked out 'bf4b545a7cab55f73909fff6e9c9ed6610d75ad2'

	Cloning into 'arrangements/EinsteinUtils'...

	Submodule path 'arrangements/EinsteinUtils': checked out 'de440c7bb911b18f959bf546845081898daadbd3'

	Cloning into 'arrangements/ExternalLibraries/BLAS'...

	Submodule path 'arrangements/ExternalLibraries/BLAS': checked out '5b5b6a8a6c5cad8070720ee596a68f9476e4c332'

	Cloning into 'arrangements/ExternalLibraries/FFTW3'...

	Submodule path 'arrangements/ExternalLibraries/FFTW3': checked out 'fa147efbd43f0e47e62a22a51258a39552427cd0'

	Cloning into 'arrangements/ExternalLibraries/GSL'...

	Submodule path 'arrangements/ExternalLibraries/GSL': checked out 'cbff544013320c0a9dd397203856e8a641b9c366'

	Cloning into 'arrangements/ExternalLibraries/HDF5'...

	Submodule path 'arrangements/ExternalLibraries/HDF5': checked out 'a7a5b5577f6b9f1ec929b1d5480a0675cd2eb633'

	Cloning into 'arrangements/ExternalLibraries/LAPACK'...

	Submodule path 'arrangements/ExternalLibraries/LAPACK': checked out 'ce0f6f02e2751f8f75340200c202a26d4eb01ac0'

	Cloning into 'arrangements/ExternalLibraries/LORENE'...

	Submodule path 'arrangements/ExternalLibraries/LORENE': checked out 'd789c9ff01586c3b295955aaa1169ce7d9a902cb'

	Cloning into 'arrangements/ExternalLibraries/MPI'...

	Submodule path 'arrangements/ExternalLibraries/MPI': checked out '86f20584fad67bbbf8856439b4fef14601373300'

	Cloning into 'arrangements/ExternalLibraries/OpenBLAS'...

	Submodule path 'arrangements/ExternalLibraries/OpenBLAS': checked out 'c5ad66ed7b0d00192e8559a5c0e74ea7535f9474'

	Cloning into 'arrangements/ExternalLibraries/OpenCL'...

	Submodule path 'arrangements/ExternalLibraries/OpenCL': checked out 'dc489e8aa7c5083987dfd6c7f7f49f835885f6d6'

	Cloning into 'arrangements/ExternalLibraries/OpenSSL'...

	Submodule path 'arrangements/ExternalLibraries/OpenSSL': checked out '4c2127aa325fcf68aebafce97749f797f4dbd475'

	Cloning into 'arrangements/ExternalLibraries/PAPI'...

	Submodule path 'arrangements/ExternalLibraries/PAPI': checked out '4f83a62df8c699c032066a31c9fe73cd3ac8de0b'

	Cloning into 'arrangements/ExternalLibraries/PETSc'...

	Submodule path 'arrangements/ExternalLibraries/PETSc': checked out 'a2d3184d2059efbccfcaf0bd44139356ee6fe576'

	Cloning into 'arrangements/ExternalLibraries/hwloc'...

	Submodule path 'arrangements/ExternalLibraries/hwloc': checked out '88f621a71d36f7f70149aae19e2e1e35cfdb4f79'

	Cloning into 'arrangements/ExternalLibraries/libjpeg'...

	Submodule path 'arrangements/ExternalLibraries/libjpeg': checked out 'cf128af0d6ed30f77fb16259fc2a5b5a4542d741'

	Cloning into 'arrangements/ExternalLibraries/pciutils'...

	Submodule path 'arrangements/ExternalLibraries/pciutils': checked out 'd7f62980926ba55f4da4dd424a8a7588c8d1ba5e'

	Cloning into 'arrangements/ExternalLibraries/pthreads'...

	Submodule path 'arrangements/ExternalLibraries/pthreads': checked out '6d49acb9f13be648b1061e54fda09b9b639e2cf0'

	Cloning into 'arrangements/ExternalLibraries/zlib'...

	Submodule path 'arrangements/ExternalLibraries/zlib': checked out '7ba3a274019d377b98f919db3c152e9d47a9dd1a'

	Cloning into 'arrangements/Numerical'...

	Slave went offline during the build

	ERROR: Connection was broken: java.io.IOException: Unexpected termination of the channel

	at hudson.remoting.SynchronousCommandTransport$ReaderThread.run(SynchronousCommandTransport.java:50)

	Caused by: java.io.EOFException

	at java.io.ObjectInputStream$PeekInputStream.readFully(ObjectInputStream.java:2332)

	at java.io.ObjectInputStream$BlockDataInputStream.readShort(ObjectInputStream.java:2801)

	at java.io.ObjectInputStream.readStreamHeader(ObjectInputStream.java:801)

	at java.io.ObjectInputStream.<init>(ObjectInputStream.java:299)

	at hudson.remoting.ObjectInputStreamEx.<init>(ObjectInputStreamEx.java:40)

	at hudson.remoting.AbstractSynchronousByteArrayCommandTransport.read(AbstractSynchronousByteArrayCommandTransport.java:34)

	at hudson.remoting.SynchronousCommandTransport$ReaderThread.run(SynchronousCommandTransport.java:48)

	

	Build step 'Execute shell' marked build as failure

	ERROR: Publisher hudson.tasks.ArtifactArchiver aborted due to exception

	hudson.AbortException: no workspace for EinsteinToolkit #713

	at hudson.tasks.BuildStepCompatibilityLayer.perform(BuildStepCompatibilityLayer.java:72)

	at hudson.tasks.BuildStepMonitor$1.perform(BuildStepMonitor.java:20)

	at hudson.model.AbstractBuild$AbstractBuildExecution.perform(AbstractBuild.java:761)

	at hudson.model.AbstractBuild$AbstractBuildExecution.performAllBuildSteps(AbstractBuild.java:721)

	at hudson.model.Build$BuildExecution.post2(Build.java:183)

	at hudson.model.AbstractBuild$AbstractBuildExecution.post(AbstractBuild.java:670)

	at hudson.model.Run.execute(Run.java:1766)

	at hudson.model.FreeStyleBuild.run(FreeStyleBuild.java:43)

	at hudson.model.ResourceController.execute(ResourceController.java:98)

	at hudson.model.Executor.run(Executor.java:374)

	ERROR: Publisher hudson.tasks.junit.JUnitResultArchiver aborted due to exception

	hudson.AbortException: no workspace for EinsteinToolkit #713

	at hudson.tasks.BuildStepCompatibilityLayer.perform(BuildStepCompatibilityLayer.java:72)

	at hudson.tasks.BuildStepMonitor$1.perform(BuildStepMonitor.java:20)

	at hudson.model.AbstractBuild$AbstractBuildExecution.perform(AbstractBuild.java:761)

	at hudson.model.AbstractBuild$AbstractBuildExecution.performAllBuildSteps(AbstractBuild.java:721)

	at hudson.model.Build$BuildExecution.post2(Build.java:183)

	at hudson.model.AbstractBuild$AbstractBuildExecution.post(AbstractBuild.java:670)

	at hudson.model.Run.execute(Run.java:1766)

	at hudson.model.FreeStyleBuild.run(FreeStyleBuild.java:43)

	at hudson.model.ResourceController.execute(ResourceController.java:98)

	at hudson.model.Executor.run(Executor.java:374)

	IRC notifier plugin: Sending notification to: #cactus

	IRC notifier plugin: [ERROR] not connected. Cannot send message to '#cactus'

	[BFA] Scanning build for known causes...

	[BFA] No failure causes found

	[BFA] Done. 0s

	Started calculate disk usage of build

	Finished Calculation of disk usage of build in 0 seconds

	Email was triggered for: Failure - 1st

	Email was triggered for: Failure - Any

	Trigger Failure - Any was overridden by another trigger and will not send an email.

	Trigger Failure - Still was overridden by another trigger and will not send an email.

	Sending email for trigger: Failure - 1st