BUILD FAILURE
| Build URL: | https://build.barrywardell.net/job/EinsteinToolkit/800/ |
| Project: | EinsteinToolkit |
| Date of build: | Tue, 07 Jun 2016 11:50:50 +0000 |
| Build duration: | 3 min 10 sec |
[...truncated 226 lines...]
++ value=generic.sub
++ '[' -z generic.sub ']'
++ echo generic.sub
++ return 0
+ submitscript=generic.sub
+ '[' -r configs/sim ']'
+ make sim-cleandeps
Cleaning dependencies in configuration sim
Deleting all dependency files in /home/jenkins/workspace/EinsteinToolkit/configs/sim
+ simfactory/bin/sim build --thornlist manifest/einsteintoolkit.th --runscript /home/jenkins/workspace/EinsteinToolkit/cactusjenkins/build.run --optionlist ubuntu.cfg --submitscript generic.sub --reconfig
Using configuration: sim
Reconfiguring sim
Writing configuration to: /home/jenkins/workspace/EinsteinToolkit/configs/sim/OptionList
Cactus - version: 4.2.3
Reconfiguring sim.
Using configuration options from configure line
Setting fds to '4,5 -j --'
End of options from configure line
Adding configuration options from '/home/jenkins/workspace/EinsteinToolkit/configs/sim/OptionList'...
Setting VERSION to '2012-09-28'
Setting CPP to 'cpp'
Setting FPP to 'cpp'
Setting CC to 'gcc'
Setting CXX to 'g++'
Setting F77 to 'gfortran'
Setting F90 to 'gfortran'
Setting CPPFLAGS to '-DMPICH_IGNORE_CXX_SEEK'
Setting FPPFLAGS to '-traditional'
Setting CFLAGS to '-g3 -march=native -std=gnu99'
Setting CXXFLAGS to '-g3 -march=native -std=gnu++0x'
Setting F77FLAGS to '-g3 -march=native -fcray-pointer -ffixed-line-length-none -fno-range-check'
Setting F90FLAGS to '-g3 -march=native -fcray-pointer -ffixed-line-length-none -fno-range-check'
Setting LDFLAGS to '-rdynamic'
Setting LIBDIRS to ''
Setting C_LINE_DIRECTIVES to 'yes'
Setting F_LINE_DIRECTIVES to 'yes'
Setting DEBUG to 'no'
Setting CPP_DEBUG_FLAGS to '-DCARPET_DEBUG'
Setting FPP_DEBUG_FLAGS to '-DCARPET_DEBUG'
Setting C_DEBUG_FLAGS to '-O0'
Setting CXX_DEBUG_FLAGS to '-O0'
Setting F77_DEBUG_FLAGS to '-O0'
Setting F90_DEBUG_FLAGS to '-O0'
Setting OPTIMISE to 'yes'
Setting CPP_OPTIMISE_FLAGS to '-DKRANC_VECTORS'
Setting FPP_OPTIMISE_FLAGS to ''
Setting C_OPTIMISE_FLAGS to '-O2 -ffast-math'
Setting CXX_OPTIMISE_FLAGS to '-O2 -ffast-math'
Setting F77_OPTIMISE_FLAGS to '-O2 -ffast-math'
Setting F90_OPTIMISE_FLAGS to '-O2 -ffast-math'
Setting PROFILE to 'no'
Setting CPP_PROFILE_FLAGS to ''
Setting FPP_PROFILE_FLAGS to ''
Setting C_PROFILE_FLAGS to '-pg'
Setting CXX_PROFILE_FLAGS to '-pg'
Setting F77_PROFILE_FLAGS to '-pg'
Setting F90_PROFILE_FLAGS to '-pg'
Setting OPENMP to 'yes'
Setting CPP_OPENMP_FLAGS to '-fopenmp'
Setting FPP_OPENMP_FLAGS to '-fopenmp'
Setting C_OPENMP_FLAGS to '-fopenmp'
Setting CXX_OPENMP_FLAGS to '-fopenmp'
Setting F77_OPENMP_FLAGS to '-fopenmp'
Setting F90_OPENMP_FLAGS to '-fopenmp'
Setting WARN to 'yes'
Setting CPP_WARN_FLAGS to '-Wall'
Setting FPP_WARN_FLAGS to '-Wall'
Setting C_WARN_FLAGS to '-Wall'
Setting CXX_WARN_FLAGS to '-Wall'
Setting F77_WARN_FLAGS to '-Wall'
Setting F90_WARN_FLAGS to '-Wall'
Setting MPI_DIR to '/usr'
Setting PTHREADS_DIR to 'NO_BUILD'
End of options from '/home/jenkins/workspace/EinsteinToolkit/configs/sim/OptionList'.
creating cache ./config.cache
checking host system type... x86_64-unknown-linux-gnu
checking whether make sets ${MAKE}... yes
checking whether the C compiler (gcc -g3 -march=native -std=gnu99 -rdynamic) works... no
configure: error: installation or configuration problem: C compiler cannot create executables (see configs/<configname>/config-data/config.log for details).
Error reconfiguring sim-config
make: *** [sim-config] Error 2
Build step 'Execute shell' marked build as failure
Archiving artifacts
Recording test results
ERROR: Step ‘Publish JUnit test result report’ failed: Test reports were found but none of them are new. Did tests run?
For example, /home/jenkins/workspace/EinsteinToolkit/testresults.xml is 2 mo 24 days old
IRC notifier plugin: Sending notification to: #cactus
IRC notifier plugin: [ERROR] not connected. Cannot send message to '#cactus'
[BFA] Scanning build for known causes...
[BFA] No failure causes found
[BFA] Done. 0s
Started calculate disk usage of build
Finished Calculation of disk usage of build in 0 seconds
Started calculate disk usage of workspace
Finished Calculation of disk usage of workspace in 14 second
Email was triggered for: Failure - Any
Sending email for trigger: Failure - Any