BUILD FAILURE

Build URL:https://build.barrywardell.net/job/EinsteinToolkit/767/
Project:EinsteinToolkit
Date of build:Mon, 16 May 2016 17:04:30 +0000
Build duration:4.8 sec

Changes

No changes


Console Output


	Started by an SCM change

	[EnvInject] - Loading node environment variables.

	Building remotely on AEI (slave large) in workspace /home/jenkins/workspace/EinsteinToolkit

	> git rev-parse --is-inside-work-tree # timeout=10

	Fetching changes from the remote Git repository

	> git config remote.origin.url https://bitbucket.org/einsteintoolkit/einsteintoolkit.git # timeout=10

	Fetching upstream changes from https://bitbucket.org/einsteintoolkit/einsteintoolkit.git

	> git --version # timeout=10

	> git -c core.askpass=true fetch --tags --progress https://bitbucket.org/einsteintoolkit/einsteintoolkit.git +refs/heads/*:refs/remotes/origin/*

	ERROR: Error fetching remote repo 'origin'

	hudson.plugins.git.GitException: Failed to fetch from https://bitbucket.org/einsteintoolkit/einsteintoolkit.git

	at hudson.plugins.git.GitSCM.fetchFrom(GitSCM.java:735)

	at hudson.plugins.git.GitSCM.retrieveChanges(GitSCM.java:983)

	at hudson.plugins.git.GitSCM.checkout(GitSCM.java:1016)

	at hudson.scm.SCM.checkout(SCM.java:485)

	at hudson.model.AbstractProject.checkout(AbstractProject.java:1269)

	at hudson.model.AbstractBuild$AbstractBuildExecution.defaultCheckout(AbstractBuild.java:607)

	at jenkins.scm.SCMCheckoutStrategy.checkout(SCMCheckoutStrategy.java:86)

	at hudson.model.AbstractBuild$AbstractBuildExecution.run(AbstractBuild.java:529)

	at hudson.model.Run.execute(Run.java:1738)

	at hudson.model.FreeStyleBuild.run(FreeStyleBuild.java:43)

	at hudson.model.ResourceController.execute(ResourceController.java:98)

	at hudson.model.Executor.run(Executor.java:410)

	Caused by: hudson.plugins.git.GitException: Command "git -c core.askpass=true fetch --tags --progress https://bitbucket.org/einsteintoolkit/einsteintoolkit.git +refs/heads/*:refs/remotes/origin/*" returned status code 1:

	stdout: Fetching submodule repos/carpet

	

	stderr: remote: Counting objects: 3, done.

	remote: Compressing objects:  33% (1/3)

	remote: Compressing objects:  66% (2/3)

	remote: Compressing objects: 100% (3/3)

	remote: Compressing objects: 100% (3/3), done.

	remote: Total 3 (delta 2), reused 0 (delta 0)

	From https://bitbucket.org/einsteintoolkit/einsteintoolkit

	d2f3f26..4363537  master     -> origin/master

	fatal: Authentication failed

	

	at org.jenkinsci.plugins.gitclient.CliGitAPIImpl.launchCommandIn(CliGitAPIImpl.java:1591)

	at org.jenkinsci.plugins.gitclient.CliGitAPIImpl.launchCommandWithCredentials(CliGitAPIImpl.java:1379)

	at org.jenkinsci.plugins.gitclient.CliGitAPIImpl.access$300(CliGitAPIImpl.java:86)

	at org.jenkinsci.plugins.gitclient.CliGitAPIImpl$1.execute(CliGitAPIImpl.java:324)

	at org.jenkinsci.plugins.gitclient.RemoteGitImpl$CommandInvocationHandler$1.call(RemoteGitImpl.java:152)

	at org.jenkinsci.plugins.gitclient.RemoteGitImpl$CommandInvocationHandler$1.call(RemoteGitImpl.java:145)

	at hudson.remoting.UserRequest.perform(UserRequest.java:120)

	at hudson.remoting.UserRequest.perform(UserRequest.java:48)

	at hudson.remoting.Request$2.run(Request.java:326)

	at hudson.remoting.InterceptingExecutorService$1.call(InterceptingExecutorService.java:68)

	at java.util.concurrent.FutureTask.run(FutureTask.java:262)

	at java.util.concurrent.ThreadPoolExecutor.runWorker(ThreadPoolExecutor.java:1145)

	at java.util.concurrent.ThreadPoolExecutor$Worker.run(ThreadPoolExecutor.java:615)

	at java.lang.Thread.run(Thread.java:745)

	at ......remote call to AEI(Native Method)

	at hudson.remoting.Channel.attachCallSiteStackTrace(Channel.java:1416)

	at hudson.remoting.UserResponse.retrieve(UserRequest.java:220)

	at hudson.remoting.Channel.call(Channel.java:781)

	at org.jenkinsci.plugins.gitclient.RemoteGitImpl$CommandInvocationHandler.execute(RemoteGitImpl.java:145)

	at sun.reflect.GeneratedMethodAccessor792.invoke(Unknown Source)

	at sun.reflect.DelegatingMethodAccessorImpl.invoke(DelegatingMethodAccessorImpl.java:43)

	at java.lang.reflect.Method.invoke(Method.java:606)

	at org.jenkinsci.plugins.gitclient.RemoteGitImpl$CommandInvocationHandler.invoke(RemoteGitImpl.java:131)

	at com.sun.proxy.$Proxy65.execute(Unknown Source)

	at hudson.plugins.git.GitSCM.fetchFrom(GitSCM.java:733)

	... 11 more

	ERROR: Error fetching remote repo 'origin'

	Archiving artifacts

	Recording test results

	ERROR: Step ‘Publish JUnit test result report’ failed: Test reports were found but none of them are new. Did tests run?

	For example, /home/jenkins/workspace/EinsteinToolkit/testresults.xml is 2 days 19 hr old

	

	IRC notifier plugin: Sending notification to: #cactus

	IRC notifier plugin: [ERROR] not connected. Cannot send message to '#cactus'

	[BFA] Scanning build for known causes...

	[BFA] No failure causes found

	[BFA] Done. 0s

	Started calculate disk usage of build

	Finished Calculation of disk usage of build in 0 seconds

	Started calculate disk usage of workspace

	Finished Calculation of disk usage of workspace in  6 second

	Email was triggered for: Failure - Any

	Sending email for trigger: Failure - Any