BUILD FAILURE
| Build URL: | https://build-test.barrywardell.net/job/EinsteinToolkit/1334/ |
| Project: | EinsteinToolkit |
| Date of build: | Tue, 28 Aug 2018 16:45:37 +0000 |
| Build duration: | 32 sec |
| Revision: | c7ae576f5d8217eb519af461cb42b35499aa84a0 |
| Author: | Einstein Toolkit Git Server |
| Log: | Updated submodules: * arrangements/WVUThorns db2e894...ca5c00b (1): > GiRaFFE: Update documentation, at reviewer Roland Haas' request. GiRaFFE/IllinoisGRMHD: Remove SCRIPT and LANG from configuration.ccl |
| Revision: | 964c443716806a72618e45b3ce463e56f57c1d31 |
| Author: | Einstein Toolkit Git Server |
| Log: | Updated submodules: * arrangements/WVUThorns ca5c00b...04faa2a (1): > GiRaFFE review: Add warning that current symmetry thorns in ETK do not support staggered gridfunctions |
| Revision: | 4b41a91c48a817afa97864e3ef7df6431c55cff6 |
| Author: | Einstein Toolkit Git Server |
| Log: | Updated submodules:
* arrangements/WVUThorns 04faa2a...83d7e45 (2):
> GiRaFFE review: remove commented-out, wrong prolongation operators
> GiRaFFE review: Document that the "st" in mhd_st_i = \tilde{S}_i
stands for "\tilde{S}"
|
| Revision: | 84f26b1f672a2aed362e62b0f43ab0ff1203e484 |
| Author: | Einstein Toolkit Git Server |
| Log: | Updated submodules: * arrangements/WVUThorns 83d7e45...92760d1 (1): > GiRaFFE review: Remove backslashes from interface.ccl comment blocks, so as not to confuse the parser. |
| Revision: | 5670e4ac1800fdf3d8ccae95a876fa5561e9a149 |
| Author: | Einstein Toolkit Git Server |
| Log: | Updated submodules: * arrangements/WVUThorns 92760d1...9162770 (1): > GiRaFFE review: Make sure all gridfunction groups are properly commented, both in GiRaFFE and IllinoisGRMHD. |
| Revision: | 850a6718b4253a15378e9a352b0fd21f03033e33 |
| Author: | Einstein Toolkit Git Server |
| Log: | Updated submodules: * arrangements/WVUThorns 9162770...e39ac18 (1): > GiRaFFE review: Remove GiRaFFE_MaxNumEvolvedVars and IllinoisGRMHD_MaxNumEvolvedVars from GiRaFFE and IllinoisGRMHD, respectively. MoL now figures this out on its own. |
| Revision: | 620b1391f32fb81807321cad99ba80a8bb27c743 |
| Author: | Einstein Toolkit Git Server |
| Log: | Updated submodules: * arrangements/WVUThorns e39ac18...8de7148 (1): > GiRaFFE review: Remove "equatorial" symmetry option from GiRaFFE and IllinoisGRMHD until it has been fully tested. |
| Revision: | 51456465a494f7c518e0e196dff55603c535d7ef |
| Author: | Einstein Toolkit Git Server |
| Log: | Updated submodules: * arrangements/WVUThorns 8de7148...7556855 (1): > GiRaFFE review: Add nice gridfunction staggering table to documentation |
|
|
[...truncated 78.94 KB...] ******************************************************************************** Running configuration script for thorn PTHREADS: PTHREADS selected, but PTHREADS_DIR not set. Checking some places... Found PTHREADS in /usr Finished running configuration script for thorn PTHREADS. ******************************************************************************** Running configuration script for thorn VECTORS: Finished running configuration script for thorn VECTORS. ******************************************************************************** Running configuration script for thorn ZLIB: zlib selected, but ZLIB_DIR not set. Checking some places... Found zlib in /usr Finished running configuration script for thorn ZLIB. ******************************************************************************** Running configuration script for thorn HWLOC: hwloc selected, but HWLOC_DIR not set. Checking some places... pkg-config not found; attempting to use reasonable defaults hwloc not found Using bundled hwloc... Finished running configuration script for thorn HWLOC. ******************************************************************************** Running configuration script for thorn MPI: MPI selected, but MPI_DIR is not set. Computing settings... Found MPI compiler wrapper at /usr/bin/mpic++! Successfully configured MPI. Finished running configuration script for thorn MPI. ******************************************************************************** Running configuration script for thorn HDF5: CST error in /home/jenkins/workspace/EinsteinToolkit/lib/sbin/ImpParamConsistency.pl (at 82) -> Thorn "GiRaFFEfood" attempted to EXTEND or USE non-existent parameter "B_p_aligned_rotator" from implementation "GIRAFFE" Additional requested language support: Fortran HDF5 selected, but HDF5_DIR not set. Checking pkg-config ... HDF5 found: /usr Finished running configuration script for thorn HDF5. Checking consistency... Creating Thorn-Flesh bindings... Creating implementation bindings... Creating parameter bindings... CST error in /home/jenkins/workspace/EinsteinToolkit/lib/sbin/create_c_stuff.pl (at 140) -> Unknown parameter type '' for parameter 'B_p_aligned_rotator' Creating variable bindings... Creating schedule bindings... Creating function bindings... ------------------------------------------------------ There were 2 errors during execution of the CST These must be corrected before compilation can proceed ------------------------------------------------------ ------------------------------------------------------ Warnings were generated during execution of the CST ------------------------------------------------------ CST error in /home/jenkins/workspace/EinsteinToolkit/lib/sbin/ImpParamConsistency.pl (at 82) -> Thorn "GiRaFFEfood" attempted to EXTEND or USE non-existent parameter "B_p_aligned_rotator" from implementation "GIRAFFE" CST error in /home/jenkins/workspace/EinsteinToolkit/lib/sbin/create_c_stuff.pl (at 140) -> Unknown parameter type '' for parameter 'B_p_aligned_rotator' ------------------------------------------------------ /home/jenkins/workspace/EinsteinToolkit/lib/make/make.configuration:214: recipe for target '/home/jenkins/workspace/EinsteinToolkit/configs/sim/config-data/make.thornlist' failed make[1]: *** [/home/jenkins/workspace/EinsteinToolkit/configs/sim/config-data/make.thornlist] Error 1 Makefile:256: recipe for target 'sim' failed make: *** [sim] Error 2 Build step 'Execute shell' marked build as failure Archiving artifacts Recording test results ERROR: Step ?Publish JUnit test result report? failed: Test reports were found but none of them are new. Did tests run? For example, /home/jenkins/workspace/EinsteinToolkit/testresults.xml is 1 hr 32 min old IRC notifier plugin: Sending notification to: #cactus IRC notifier plugin: [ERROR] not connected. Cannot send message to '#cactus' [BFA] Scanning build for known causes... [BFA] No failure causes found [BFA] Done. 0s Started calculate disk usage of build Finished Calculation of disk usage of build in 0 seconds Started calculate disk usage of workspace Finished Calculation of disk usage of workspace in 1 second Email was triggered for: Failure - 1st Email was triggered for: Failure - Any Trigger Failure - Any was overridden by another trigger and will not send an email. Trigger Failure - Still was overridden by another trigger and will not send an email. Sending email for trigger: Failure - 1st