BUILD FAILURE
| Build URL: | https://build.barrywardell.net/job/EinsteinToolkit/1705/ |
| Project: | EinsteinToolkit |
| Date of build: | Mon, 27 Jul 2020 14:58:33 +0000 |
| Build duration: | 26 min |
| Revision: | 47c3a58fea2cd7bb0fabd008cc1adb0d4e4db66f |
| Author: | Roland Haas |
| Log: | updated submodules Submodule arrangements/CactusElliptic daeeadc..5934bfb: > TATPETSc: avoid compiler warning in call to free() > TATPETSc: handle newlines in option strings > TATPETSc: request only access required when copying > TATPETSc: set of DM object after creating it > TATPETSc: remove use of Symmetry.h header file Submodule arrangements/ExternalLibraries/OpenBLAS cf871fc..73f3ba9: > OpenBLAS: work around OpenBLAS's strange way of determining linked libs > OpenBLAS: update tarball to 0.3.9 Submodule arrangements/ExternalLibraries/PETSc 89b5ec9..9fd9905: > PETSc: avoid configure complaining about env variables > PETSc: update tarball to 3.12.5 |
[...truncated 743.60 KB...] COMPILING McLachlan/ML_ADMQuantities/src/Startup.cc Updating /home/jenkins/workspace/EinsteinToolkit/configs/sim/lib/libthorn_ML_ADMQuantities.a COMPILING configs/sim/bindings/build/ML_BSSN/cctk_ThornBindings.c COMPILING McLachlan/ML_BSSN/src/ML_BSSN_ADMBaseInterior.cc COMPILING McLachlan/ML_BSSN/src/ML_BSSN_ConstraintsEverywhere.cc Checking status of thorn ML_CCZ4 COMPILING McLachlan/ML_CCZ4/src/Boundaries.cc COMPILING McLachlan/ML_CCZ4/src/Kranc.cc COMPILING McLachlan/ML_CCZ4/src/ML_CCZ4_ADMBaseBoundaryScalar.cc COMPILING McLachlan/ML_BSSN/src/ML_BSSN_ConstraintsInterior.cc COMPILING McLachlan/ML_CCZ4/src/ML_CCZ4_ADMBaseEverywhere.cc COMPILING McLachlan/ML_CCZ4/src/ML_CCZ4_ADMBaseInterior.cc COMPILING McLachlan/ML_CCZ4/src/ML_CCZ4_ConstraintsEverywhere.cc COMPILING McLachlan/ML_CCZ4/src/ML_CCZ4_ConstraintsInterior.cc COMPILING McLachlan/ML_BSSN/src/ML_BSSN_EnforceEverywhere.cc COMPILING McLachlan/ML_BSSN/src/ML_BSSN_EvolutionAnalysisInit.cc COMPILING McLachlan/ML_BSSN/src/ML_BSSN_EvolutionAnalysisInterior.cc COMPILING McLachlan/ML_CCZ4/src/ML_CCZ4_EnforceEverywhere.cc COMPILING McLachlan/ML_CCZ4/src/ML_CCZ4_EvolutionAnalysisInit.cc COMPILING McLachlan/ML_CCZ4/src/ML_CCZ4_EvolutionAnalysisInterior.cc COMPILING McLachlan/ML_BSSN/src/ML_BSSN_EvolutionBoundaryScalar.cc COMPILING McLachlan/ML_BSSN/src/ML_BSSN_EvolutionInterior.cc COMPILING McLachlan/ML_CCZ4/src/ML_CCZ4_EvolutionBoundaryScalar.cc COMPILING McLachlan/ML_CCZ4/src/ML_CCZ4_EvolutionInterior.cc COMPILING McLachlan/ML_BSSN/src/ML_BSSN_EvolutionInteriorSplitBy1.cc COMPILING McLachlan/ML_BSSN/src/ML_BSSN_EvolutionInteriorSplitBy2.cc COMPILING McLachlan/ML_CCZ4/src/ML_CCZ4_EvolutionInteriorSplitBy1.cc COMPILING McLachlan/ML_BSSN/src/ML_BSSN_EvolutionInteriorSplitBy3.cc FATAL: command execution failed java.io.EOFException at java.io.ObjectInputStream$PeekInputStream.readFully(ObjectInputStream.java:2738) at java.io.ObjectInputStream$BlockDataInputStream.readShort(ObjectInputStream.java:3213) at java.io.ObjectInputStream.readStreamHeader(ObjectInputStream.java:896) at java.io.ObjectInputStream.<init>(ObjectInputStream.java:358) at hudson.remoting.ObjectInputStreamEx.<init>(ObjectInputStreamEx.java:49) at hudson.remoting.Command.readFrom(Command.java:142) at hudson.remoting.Command.readFrom(Command.java:128) at hudson.remoting.AbstractSynchronousByteArrayCommandTransport.read(AbstractSynchronousByteArrayCommandTransport.java:35) at hudson.remoting.SynchronousCommandTransport$ReaderThread.run(SynchronousCommandTransport.java:63) Caused: java.io.IOException: Unexpected termination of the channel at hudson.remoting.SynchronousCommandTransport$ReaderThread.run(SynchronousCommandTransport.java:77) Caused: java.io.IOException: Backing channel 'ncsa-20.04' is disconnected. at hudson.remoting.RemoteInvocationHandler.channelOrFail(RemoteInvocationHandler.java:216) at hudson.remoting.RemoteInvocationHandler.invoke(RemoteInvocationHandler.java:285) at com.sun.proxy.$Proxy78.isAlive(Unknown Source) at hudson.Launcher$RemoteLauncher$ProcImpl.isAlive(Launcher.java:1147) at hudson.Launcher$RemoteLauncher$ProcImpl.join(Launcher.java:1139) at hudson.tasks.CommandInterpreter.join(CommandInterpreter.java:155) at hudson.tasks.CommandInterpreter.perform(CommandInterpreter.java:109) at hudson.tasks.CommandInterpreter.perform(CommandInterpreter.java:66) at hudson.tasks.BuildStepMonitor$1.perform(BuildStepMonitor.java:20) at hudson.model.AbstractBuild$AbstractBuildExecution.perform(AbstractBuild.java:741) at hudson.model.Build$BuildExecution.build(Build.java:206) at hudson.model.Build$BuildExecution.doRun(Build.java:163) at hudson.model.AbstractBuild$AbstractBuildExecution.run(AbstractBuild.java:504) at hudson.model.Run.execute(Run.java:1880) at hudson.model.FreeStyleBuild.run(FreeStyleBuild.java:43) at hudson.model.ResourceController.execute(ResourceController.java:97) at hudson.model.Executor.run(Executor.java:428) FATAL: Unable to delete script file /tmp/jenkins11362510507101116012.sh java.io.EOFException at java.io.ObjectInputStream$PeekInputStream.readFully(ObjectInputStream.java:2738) at java.io.ObjectInputStream$BlockDataInputStream.readShort(ObjectInputStream.java:3213) at java.io.ObjectInputStream.readStreamHeader(ObjectInputStream.java:896) at java.io.ObjectInputStream.<init>(ObjectInputStream.java:358) at hudson.remoting.ObjectInputStreamEx.<init>(ObjectInputStreamEx.java:49) at hudson.remoting.Command.readFrom(Command.java:142) at hudson.remoting.Command.readFrom(Command.java:128) at hudson.remoting.AbstractSynchronousByteArrayCommandTransport.read(AbstractSynchronousByteArrayCommandTransport.java:35) at hudson.remoting.SynchronousCommandTransport$ReaderThread.run(SynchronousCommandTransport.java:63) Caused: java.io.IOException: Unexpected termination of the channel at hudson.remoting.SynchronousCommandTransport$ReaderThread.run(SynchronousCommandTransport.java:77) Caused: hudson.remoting.ChannelClosedException: Channel "hudson.remoting.Channel@73645888:ncsa-20.04": Remote call on ncsa-20.04 failed. The channel is closing down or has closed down at hudson.remoting.Channel.call(Channel.java:991) at hudson.FilePath.act(FilePath.java:1069) at hudson.FilePath.act(FilePath.java:1058) at hudson.FilePath.delete(FilePath.java:1543) at hudson.tasks.CommandInterpreter.perform(CommandInterpreter.java:123) at hudson.tasks.CommandInterpreter.perform(CommandInterpreter.java:66) at hudson.tasks.BuildStepMonitor$1.perform(BuildStepMonitor.java:20) at hudson.model.AbstractBuild$AbstractBuildExecution.perform(AbstractBuild.java:741) at hudson.model.Build$BuildExecution.build(Build.java:206) at hudson.model.Build$BuildExecution.doRun(Build.java:163) at hudson.model.AbstractBuild$AbstractBuildExecution.run(AbstractBuild.java:504) at hudson.model.Run.execute(Run.java:1880) at hudson.model.FreeStyleBuild.run(FreeStyleBuild.java:43) at hudson.model.ResourceController.execute(ResourceController.java:97) at hudson.model.Executor.run(Executor.java:428) Build step 'Execute shell' marked build as failure ERROR: Step ?Archive the artifacts? failed: no workspace for EinsteinToolkit #1705 ERROR: Step ?Console output (build log) parsing? failed: no workspace for EinsteinToolkit #1705 ERROR: Step ?Publish JUnit test result report? failed: no workspace for EinsteinToolkit #1705 ERROR: Step ?Allow broken build claiming? failed: no workspace for EinsteinToolkit #1705 IRC notifier plugin: Sending notification to: #cactus IRC notifier plugin: [ERROR] not connected. Cannot send message to '#cactus' Started calculate disk usage of build Finished Calculation of disk usage of build in 0 seconds Email was triggered for: Failure - Any Sending email for trigger: Failure - Any