BUILD FAILURE
| Build URL: | https://build.barrywardell.net/job/EinsteinToolkit/1638/ |
| Project: | EinsteinToolkit |
| Date of build: | Thu, 14 May 2020 13:39:04 +0000 |
| Build duration: | 2 min 5 sec |
| Revision: | ef3bedb6adb67f792e4228ac7499ed6715decce3 |
| Author: | Einstein Toolkit Git Server |
| Log: | Updated submodules: * flesh 1a8684a...3ecd69d (3): > Cactus: avoid LaTeX warnings > Cactus: document rename of psync to presync > Cactus: introduce single presync_mode parameter to code * repos/carpet 9ec643c...c03e19f (7): > Carpet: unify warnings, use presync_mode parameter > Carpet: use presync_mode > CarpetIOScalar: use presync_mode parameter > CarpetIOHDF5: use presync_mode parameter > CarpetIOBasic: use psync_mode parameter > CarpetIOASCII: use psync_mode parameter > Carpet: provide QueryDriverBCForVarI function |
[...truncated 101.90 KB...] Finished running configuration script for thorn ZLIB. ******************************************************************************** Running configuration script for thorn HWLOC: hwloc selected, but HWLOC_DIR not set. Checking some places... pkg-config not found; attempting to use reasonable defaults hwloc not found Using bundled hwloc... Finished running configuration script for thorn HWLOC. ******************************************************************************** Running configuration script for thorn MPI: MPI selected, but MPI_DIR is not set. Computing settings... Found MPI compiler wrapper at /usr/bin/mpic++! Successfully configured MPI. Finished running configuration script for thorn MPI. ******************************************************************************** Running configuration script for thorn HDF5: CST error in /home/jenkins/workspace/EinsteinToolkit/flesh/lib/sbin/ImpParamConsistency.pl (at 82) -> Thorn "Boundary" attempted to EXTEND or USE non-existent parameter "use_psync" from implementation "CACTUS" CST error in /home/jenkins/workspace/EinsteinToolkit/flesh/lib/sbin/ImpParamConsistency.pl (at 82) -> Thorn "MoL" attempted to EXTEND or USE non-existent parameter "use_psync" from implementation "CACTUS" Additional requested language support: Fortran HDF5 selected, but HDF5_DIR not set. Checking pkg-config ... HDF5 found: /usr Finished running configuration script for thorn HDF5. Checking consistency... Creating Thorn-Flesh bindings... Creating implementation bindings... Creating parameter bindings... CST error in /home/jenkins/workspace/EinsteinToolkit/flesh/lib/sbin/create_c_stuff.pl (at 140) -> Unknown parameter type '' for parameter 'use_psync' CST error in /home/jenkins/workspace/EinsteinToolkit/flesh/lib/sbin/create_c_stuff.pl (at 140) -> Unknown parameter type '' for parameter 'use_psync' Creating variable bindings... Creating schedule bindings... Creating function bindings... Generating arguments... ------------------------------------------------------ There were 4 errors during execution of the CST These must be corrected before compilation can proceed ------------------------------------------------------ ------------------------------------------------------ Warnings were generated during execution of the CST ------------------------------------------------------ CST error in /home/jenkins/workspace/EinsteinToolkit/flesh/lib/sbin/ImpParamConsistency.pl (at 82) -> Thorn "Boundary" attempted to EXTEND or USE non-existent parameter "use_psync" from implementation "CACTUS" CST error in /home/jenkins/workspace/EinsteinToolkit/flesh/lib/sbin/ImpParamConsistency.pl (at 82) -> Thorn "MoL" attempted to EXTEND or USE non-existent parameter "use_psync" from implementation "CACTUS" CST error in /home/jenkins/workspace/EinsteinToolkit/flesh/lib/sbin/create_c_stuff.pl (at 140) -> Unknown parameter type '' for parameter 'use_psync' CST error in /home/jenkins/workspace/EinsteinToolkit/flesh/lib/sbin/create_c_stuff.pl (at 140) -> Unknown parameter type '' for parameter 'use_psync' ------------------------------------------------------ /home/jenkins/workspace/EinsteinToolkit/lib/make/make.configuration:212: recipe for target '/home/jenkins/workspace/EinsteinToolkit/configs/sim/config-data/make.thornlist' failed make[1]: *** [/home/jenkins/workspace/EinsteinToolkit/configs/sim/config-data/make.thornlist] Error 1 Makefile:259: recipe for target 'sim' failed make: *** [sim] Error 2 Build step 'Execute shell' marked build as failure Archiving artifacts Recording test results ERROR: Step ?Publish JUnit test result report? failed: Test reports were found but none of them are new. Did leafNodes run? For example, /home/jenkins/workspace/EinsteinToolkit/testresults.xml is 10 hr old IRC notifier plugin: Sending notification to: #cactus IRC notifier plugin: [ERROR] not connected. Cannot send message to '#cactus' Started calculate disk usage of build Finished Calculation of disk usage of build in 0 seconds Started calculate disk usage of workspace Finished Calculation of disk usage of workspace in 7 second Email was triggered for: Failure - 1st Email was triggered for: Failure - Any Trigger Failure - Any was overridden by another trigger and will not send an email. Trigger Failure - Still was overridden by another trigger and will not send an email. Sending email for trigger: Failure - 1st