BUILD FAILURE

Build URL:https://build.barrywardell.net/job/EinsteinToolkit/1634/
Project:EinsteinToolkit
Date of build:Tue, 12 May 2020 19:00:59 +0000
Build duration:4 min 18 sec

Changes

Revision: 281178bfc6294e027fe1773b07eb20e406988477
Author:Einstein Toolkit Git Server
Log:
Updated submodules:

* flesh 0861d26...c95a075 (1):
  > Documenting psync_mode.
Revision: 3c6bc95bdd0efd06b0cbf53c7c3fb76960632729
Author:Einstein Toolkit Git Server
Log:
Updated submodules:

* arrangements/CactusBase dc7b6d7...83db407 (1):
  > Boundary: code cleanup

* arrangements/CactusTest 9609a32...be74b2b (1):
  > TestReadWrite: test DECLARE_CCTK_ARGUMENTS_CHECKED macro

* flesh c95a075...ab52f33 (1):
  > Cactus: provide DECLARE_CCTK_ARGUMENTS_CHECKED macro
Revision: e9a482f6ea29466544095da51f4d269dbb44bc65
Author:Einstein Toolkit Git Server
Log:
Updated submodules:

* flesh ab52f33...ff98a58 (1):
  > Fix typo
Revision: e1d89c4c8da3f274a00d22b4f9173fe23af13d8d
Author:Einstein Toolkit Git Server
Log:
Updated submodules:

* flesh ff98a58...b1c267a (2):
  > use description instead of itemize in UsersGuide
  > Clarification
Revision: 98c1711f0eb94266b549cacb89c3526a2d21ebb1
Author:Einstein Toolkit Git Server
Log:
Updated submodules:

* flesh b1c267a...71b58a9 (2):
  > Remove references to cctk_Arguments_Checked.h
  > Update documentation of the macros


Console Output


	[...truncated 138.13 KB...]

	const REAL_SIMD_ARRAY FDPart3_NegativeOne_ = ConstSIMD(tmpFDPart3_NegativeOne_);

	^

	/home/jenkins/workspace/EinsteinToolkit/configs/sim/build/BaikalVacuum/BSSN_Ricci_FD_order_6.c:848:38: warning: unused variable 'FDPart1_NegativeOne_' [-Wunused-variable]

	const REAL_SIMD_ARRAY FDPart1_NegativeOne_ = ConstSIMD(tmpFDPart1_NegativeOne_);

	^

	COMPILING WVUThorns/BaikalVacuum/src/BSSN_Ricci_FD_order_8.c

	/home/jenkins/workspace/EinsteinToolkit/configs/sim/build/BaikalVacuum/BSSN_Ricci_FD_order_8.c: In function 'BaikalVacuum_BSSN_Ricci_FD_order_8':

	/home/jenkins/workspace/EinsteinToolkit/configs/sim/build/BaikalVacuum/BSSN_Ricci_FD_order_8.c:1550:38: warning: unused variable 'FDPart3_NegativeOne_' [-Wunused-variable]

	const REAL_SIMD_ARRAY FDPart3_NegativeOne_ = ConstSIMD(tmpFDPart3_NegativeOne_);

	^

	/home/jenkins/workspace/EinsteinToolkit/configs/sim/build/BaikalVacuum/BSSN_Ricci_FD_order_8.c:1406:38: warning: unused variable 'FDPart1_NegativeOne_' [-Wunused-variable]

	const REAL_SIMD_ARRAY FDPart1_NegativeOne_ = ConstSIMD(tmpFDPart1_NegativeOne_);

	^

	COMPILING WVUThorns/BaikalVacuum/src/BSSN_Ricci_FD_order_4.c

	/home/jenkins/workspace/EinsteinToolkit/configs/sim/build/BaikalVacuum/BSSN_Ricci_FD_order_4.c: In function 'BaikalVacuum_BSSN_Ricci_FD_order_4':

	/home/jenkins/workspace/EinsteinToolkit/configs/sim/build/BaikalVacuum/BSSN_Ricci_FD_order_4.c:545:38: warning: unused variable 'FDPart3_NegativeOne_' [-Wunused-variable]

	const REAL_SIMD_ARRAY FDPart3_NegativeOne_ = ConstSIMD(tmpFDPart3_NegativeOne_);

	^

	/home/jenkins/workspace/EinsteinToolkit/configs/sim/build/BaikalVacuum/BSSN_Ricci_FD_order_4.c:434:38: warning: unused variable 'FDPart1_NegativeOne_' [-Wunused-variable]

	const REAL_SIMD_ARRAY FDPart1_NegativeOne_ = ConstSIMD(tmpFDPart1_NegativeOne_);

	^

	COMPILING WVUThorns/BaikalVacuum/src/driver_pt2_BSSN_RHSs.c

	COMPILING WVUThorns/BaikalVacuum/src/BSSN_RHSs_enable_Tmunu_False_FD_order_6.c

	/home/jenkins/workspace/EinsteinToolkit/configs/sim/build/BaikalVacuum/BSSN_RHSs_enable_Tmunu_False_FD_order_6.c: In function 'BaikalVacuum_BSSN_RHSs_enable_Tmunu_False_FD_order_6':

	/home/jenkins/workspace/EinsteinToolkit/configs/sim/build/BaikalVacuum/BSSN_RHSs_enable_Tmunu_False_FD_order_6.c:1611:38: warning: unused variable 'FDPart2_NegativeOne_' [-Wunused-variable]

	const REAL_SIMD_ARRAY FDPart2_NegativeOne_ = ConstSIMD(tmpFDPart2_NegativeOne_);

	^

	/home/jenkins/workspace/EinsteinToolkit/configs/sim/build/BaikalVacuum/BSSN_RHSs_enable_Tmunu_False_FD_order_6.c:1184:38: warning: unused variable 'FDPart1_NegativeOne_' [-Wunused-variable]

	const REAL_SIMD_ARRAY FDPart1_NegativeOne_ = ConstSIMD(tmpFDPart1_NegativeOne_);

	^

	/home/jenkins/workspace/EinsteinToolkit/configs/sim/build/BaikalVacuum/BSSN_RHSs_enable_Tmunu_False_FD_order_6.c:17:27: warning: unused variable 'PI' [-Wunused-variable]

	const REAL_SIMD_ARRAY PI = ConstSIMD(*NOSIMDPI);

	^

	Updating /home/jenkins/workspace/EinsteinToolkit/configs/sim/lib/libthorn_AEILocalInterp.a

	COMPILING WVUThorns/BaikalVacuum/src/BSSN_RHSs_enable_Tmunu_False_FD_order_8.c

	/home/jenkins/workspace/EinsteinToolkit/configs/sim/build/BaikalVacuum/BSSN_RHSs_enable_Tmunu_False_FD_order_8.c: In function 'BaikalVacuum_BSSN_RHSs_enable_Tmunu_False_FD_order_8':

	/home/jenkins/workspace/EinsteinToolkit/configs/sim/build/BaikalVacuum/BSSN_RHSs_enable_Tmunu_False_FD_order_8.c:2199:38: warning: unused variable 'FDPart2_NegativeOne_' [-Wunused-variable]

	const REAL_SIMD_ARRAY FDPart2_NegativeOne_ = ConstSIMD(tmpFDPart2_NegativeOne_);

	^

	/home/jenkins/workspace/EinsteinToolkit/configs/sim/build/BaikalVacuum/BSSN_RHSs_enable_Tmunu_False_FD_order_8.c:1748:38: warning: unused variable 'FDPart1_NegativeOne_' [-Wunused-variable]

	const REAL_SIMD_ARRAY FDPart1_NegativeOne_ = ConstSIMD(tmpFDPart1_NegativeOne_);

	^

	/home/jenkins/workspace/EinsteinToolkit/configs/sim/build/BaikalVacuum/BSSN_RHSs_enable_Tmunu_False_FD_order_8.c:17:27: warning: unused variable 'PI' [-Wunused-variable]

	const REAL_SIMD_ARRAY PI = ConstSIMD(*NOSIMDPI);

	^

	Checking status of thorn Boundary

	COMPILING CactusBase/Boundary/src/ScalarBoundary.c

	COMPILING CactusBase/Boundary/src/StaticBoundary.c

	COMPILING CactusBase/Boundary/src/CopyBoundary.c

	COMPILING CactusBase/Boundary/src/FlatBoundary.c

	COMPILING CactusBase/Boundary/src/RadiationBoundary.c

	COMPILING CactusBase/Boundary/src/RobinBoundary.c

	COMPILING CactusBase/Boundary/src/NoneBoundary.c

	COMPILING CactusBase/Boundary/src/Boundary.c

	/home/jenkins/workspace/EinsteinToolkit/configs/sim/build/Boundary/Boundary.c: In function 'Bdry_Boundary_SelectedGVs':

	/home/jenkins/workspace/EinsteinToolkit/configs/sim/build/Boundary/Boundary.c:943:13: error: 'use_psync' undeclared (first use in this function)

	if (use_psync && have_driver_query) {

	^

	/home/jenkins/workspace/EinsteinToolkit/configs/sim/build/Boundary/Boundary.c:943:13: note: each undeclared identifier is reported only once for each function it appears in

	/home/jenkins/workspace/EinsteinToolkit/configs/sim/config-data/make.config.rules:264: recipe for target 'Boundary.c.o' failed

	make[3]: *** [Boundary.c.o] Error 1

	/home/jenkins/workspace/EinsteinToolkit/lib/make/make.thornlib:112: recipe for target 'make.checked' failed

	make[2]: *** [make.checked] Error 2

	/home/jenkins/workspace/EinsteinToolkit/lib/make/make.configuration:179: recipe for target '/home/jenkins/workspace/EinsteinToolkit/configs/sim/lib/libthorn_Boundary.a' failed

	make[1]: *** [/home/jenkins/workspace/EinsteinToolkit/configs/sim/lib/libthorn_Boundary.a] Error 2

	make[1]: *** Waiting for unfinished jobs....

	COMPILING WVUThorns/BaikalVacuum/src/BSSN_RHSs_enable_Tmunu_False_FD_order_4.c

	/home/jenkins/workspace/EinsteinToolkit/configs/sim/build/BaikalVacuum/BSSN_RHSs_enable_Tmunu_False_FD_order_4.c: In function 'BaikalVacuum_BSSN_RHSs_enable_Tmunu_False_FD_order_4':

	/home/jenkins/workspace/EinsteinToolkit/configs/sim/build/BaikalVacuum/BSSN_RHSs_enable_Tmunu_False_FD_order_4.c:1143:38: warning: unused variable 'FDPart2_NegativeOne_' [-Wunused-variable]

	const REAL_SIMD_ARRAY FDPart2_NegativeOne_ = ConstSIMD(tmpFDPart2_NegativeOne_);

	^

	/home/jenkins/workspace/EinsteinToolkit/configs/sim/build/BaikalVacuum/BSSN_RHSs_enable_Tmunu_False_FD_order_4.c:740:38: warning: unused variable 'FDPart1_NegativeOne_' [-Wunused-variable]

	const REAL_SIMD_ARRAY FDPart1_NegativeOne_ = ConstSIMD(tmpFDPart1_NegativeOne_);

	^

	/home/jenkins/workspace/EinsteinToolkit/configs/sim/build/BaikalVacuum/BSSN_RHSs_enable_Tmunu_False_FD_order_4.c:17:27: warning: unused variable 'PI' [-Wunused-variable]

	const REAL_SIMD_ARRAY PI = ConstSIMD(*NOSIMDPI);

	^

	COMPILING WVUThorns/BaikalVacuum/src/driver_enforcedetgammabar_constraint.c

	COMPILING WVUThorns/BaikalVacuum/src/driver_BSSN_constraints.c

	Updating /home/jenkins/workspace/EinsteinToolkit/configs/sim/lib/libthorn_BaikalVacuum.a

	Makefile:259: recipe for target 'sim' failed

	make: *** [sim] Error 2

	Build step 'Execute shell' marked build as failure

	Archiving artifacts

	Recording test results

	ERROR: Step ?Publish JUnit test result report? failed: Test reports were found but none of them are new. Did leafNodes run?

	For example, /home/jenkins/workspace/EinsteinToolkit/testresults.xml is 1 day 3 hr old

	

	IRC notifier plugin: Sending notification to: #cactus

	IRC notifier plugin: [ERROR] not connected. Cannot send message to '#cactus'

	Started calculate disk usage of build

	Finished Calculation of disk usage of build in 0 seconds

	Started calculate disk usage of workspace

	Finished Calculation of disk usage of workspace in  8 second

	Email was triggered for: Failure - 1st

	Email was triggered for: Failure - Any

	Trigger Failure - Any was overridden by another trigger and will not send an email.

	Trigger Failure - Still was overridden by another trigger and will not send an email.

	Sending email for trigger: Failure - 1st