BUILD FAILURE
| Build URL: | https://build.barrywardell.net/job/EinsteinToolkit/367/ |
| Project: | EinsteinToolkit |
| Date of build: | Tue, 02 Dec 2014 20:44:31 +0000 |
| Build duration: | 21 min |
| Revision: | a62d8834d1b52bd8dabaef2649d486694cbca8a7 |
| Author: | Einstein Toolkit Git Server |
| Log: | Updated submodules: * arrangements/ExternalLibraries/FFTW3 4929246...3510df3 (1): > Use -Wl,-rpath * arrangements/ExternalLibraries/OpenBLAS 49dcdb8...f04362a (1): > Use correct make -j flag * arrangements/ExternalLibraries/PAPI 5e707e2...1c3aacb (1): > Hide warning * arrangements/ExternalLibraries/PETSc fae9f39...3a56e57 (1): > Add missing makefile * arrangements/ExternalLibraries/hwloc a3c3182...5b9a9a4 (1): > Update check for pciutils * arrangements/ExternalLibraries/pciutils 4dbbb1d...d7f6298 (1): > Honour VERBOSE option |
[...truncated 4565 lines...] CC arch-linux2-c-debug/obj/src/tao/pde_constrained/impls/lcl/lcl.o CC arch-linux2-c-debug/obj/src/tao/complementarity/impls/ssls/ssls.o CC arch-linux2-c-debug/obj/src/tao/complementarity/impls/ssls/ssils.o CC arch-linux2-c-debug/obj/src/tao/complementarity/impls/ssls/ssfls.o CC arch-linux2-c-debug/obj/src/tao/complementarity/impls/asls/asils.o CC arch-linux2-c-debug/obj/src/tao/complementarity/impls/asls/asfls.o CC arch-linux2-c-debug/obj/src/tao/unconstrained/impls/nls/nls.o CC arch-linux2-c-debug/obj/src/tao/unconstrained/impls/neldermead/neldermead.o CC arch-linux2-c-debug/obj/src/tao/unconstrained/impls/ntr/ntr.o CC arch-linux2-c-debug/obj/src/tao/unconstrained/impls/cg/taocg.o CC arch-linux2-c-debug/obj/src/tao/unconstrained/impls/lmvm/lmvm.o CC arch-linux2-c-debug/obj/src/tao/unconstrained/impls/bmrm/bmrm.o CC arch-linux2-c-debug/obj/src/tao/unconstrained/impls/ntl/ntl.o CC arch-linux2-c-debug/obj/src/tao/unconstrained/impls/owlqn/owlqn.o CC arch-linux2-c-debug/obj/src/tao/constrained/impls/ipm/ipm.o CC arch-linux2-c-debug/obj/src/tao/linesearch/interface/taolinesearch.o CC arch-linux2-c-debug/obj/src/tao/linesearch/interface/dlregis_taolinesearch.o CC arch-linux2-c-debug/obj/src/tao/linesearch/impls/armijo/armijo.o CC arch-linux2-c-debug/obj/src/tao/linesearch/impls/morethuente/morethuente.o CC arch-linux2-c-debug/obj/src/tao/linesearch/impls/owarmijo/owarmijo.o CC arch-linux2-c-debug/obj/src/tao/linesearch/impls/unit/unit.o CC arch-linux2-c-debug/obj/src/tao/linesearch/impls/gpcglinesearch/gpcglinesearch.o CC arch-linux2-c-debug/obj/src/tao/leastsquares/impls/pounders/pounders.o CC arch-linux2-c-debug/obj/src/tao/leastsquares/impls/pounders/gqt.o AR /home/jenkins/workspace/EinsteinToolkit/configs/sim/scratch/build/PETSc/petsc-3.5.2/arch-linux2-c-debug/lib/libpetsc.a RANLIB /home/jenkins/workspace/EinsteinToolkit/configs/sim/scratch/build/PETSc/petsc-3.5.2/arch-linux2-c-debug/lib/libpetsc.a make[6]: Leaving directory `/home/jenkins/workspace/EinsteinToolkit/configs/sim/scratch/build/PETSc/petsc-3.5.2' ========================================= make[5]: Leaving directory `/home/jenkins/workspace/EinsteinToolkit/configs/sim/scratch/build/PETSc/petsc-3.5.2' Now to install the libraries do: make PETSC_DIR=/home/jenkins/workspace/EinsteinToolkit/configs/sim/scratch/build/PETSc/petsc-3.5.2 PETSC_ARCH=arch-linux2-c-debug install ========================================= PETSc: Installing... make[4]: warning: -jN forced in submake: disabling jobserver mode. *** Using PETSC_DIR=/home/jenkins/workspace/EinsteinToolkit/configs/sim/scratch/build/PETSc/petsc-3.5.2 PETSC_ARCH=arch-linux2-c-debug *** *** Installing PETSc at prefix location: /home/jenkins/workspace/EinsteinToolkit/configs/sim/scratch/external/PETSc *** ==================================== Install complete. Now to check if the libraries are working do (in current directory): make PETSC_DIR=/home/jenkins/workspace/EinsteinToolkit/configs/sim/scratch/external/PETSc PETSC_ARCH="" test ==================================== ~/workspace/EinsteinToolkit/configs/sim/build/PETSc PETSc: Cleaning up... PETSc: Done. Updating /home/jenkins/workspace/EinsteinToolkit/configs/sim/lib/libthorn_PETSc.a Checking status of thorn EllPETSc Formaline: Adding thorn PETSc to git repository... COMPILING arrangements/CactusElliptic/EllPETSc/src/petsc_confmetric_solver.c COMPILING arrangements/CactusElliptic/EllPETSc/src/petsc_flat_solver.c tar: arrangements/ExternalLibraries/PETSc/dist/petsc-3.5.2.tar.gz: file changed as we read it Updating /home/jenkins/workspace/EinsteinToolkit/configs/sim/lib/libthorn_EllPETSc.a Formaline: Adding thorn EllPETSc to git repository... Creating Formaline tarball for thorn EllPETSc Formaline: Committing source tree to git repository... Formaline: Created git tag build-sim-build-jenkins-2014.12.02-21.03.24-20079 Formaline: Updated git branch config-sim-build-home-jenkins-workspace-EinsteinToolkit Formaline: Pushing source tree to master git repository... Formaline: Pushing to local repository /home/jenkins/workspace/EinsteinToolkit/../CactusSourceJar.git... Formaline: Done. Formaline: (Formaline has finished updating the git repositories. Formaline: If the build process seems to hang, some other command Formaline: is still running, e.g. the final link stage.) Creating Formaline tarball for thorn PETSc ________________________________________________________________________ Creating cactus_sim in /home/jenkins/workspace/EinsteinToolkit/exe from EinsteinAnalysis/ADMAnalysis EinsteinBase/ADMBase EinsteinBase/ADMCoupling EinsteinBase/ADMMacros AEIThorns/ADMMass AEIThorns/AEILocalInterp EinsteinAnalysis/AHFinder EinsteinAnalysis/AHFinderDirect ExternalLibraries/BLAS CactusBase/Boundary EinsteinAnalysis/CalcK Carpet/Carpet Carpet/CarpetEvolutionMask Carpet/CarpetIOASCII Carpet/CarpetIOBasic Carpet/CarpetIOHDF5 Carpet/CarpetIOScalar Carpet/CarpetIntegrateTest Carpet/CarpetInterp Carpet/CarpetInterp2 Carpet/CarpetLib Carpet/CarpetMask Carpet/CarpetProlongateTest Carpet/CarpetReduce Carpet/CarpetRegrid Carpet/CarpetRegrid2 Carpet/CarpetRegridTest Carpet/CarpetSlab Carpet/CarpetTracker CactusBase/CartGrid3D CactusNumerical/Cartoon2D EinsteinBase/Constants CactusBase/CoordBase EinsteinBase/CoordGauge Carpet/CycleClock CactusExamples/DemoInterp CactusNumerical/Dissipation EinsteinInitialData/DistortedBHIVP EinsteinAnalysis/EHFinder EinsteinBase/EOS_Base EinsteinEOS/EOS_Hybrid EinsteinEOS/EOS_IdealFluid EinsteinEOS/EOS_Omni EinsteinEOS/EOS_Polytrope EinsteinExact/EinsteinExact_Test CactusElliptic/EllBase CactusElliptic/EllPETSc CactusElliptic/EllSOR EinsteinInitialData/Exact EinsteinAnalysis/Extract ExternalLibraries/FFTW3 CactusExamples/FleshInfo CactusUtils/Formaline CactusBase/Fortran EinsteinEvolve/GRHydro EinsteinEvolve/GRHydro_InitData ExternalLibraries/GSL EinsteinExact/GaugeWave KrancNumericalTools/GenericFD ExternalLibraries/HDF5 CactusConnect/HTTPD CactusConnect/HTTPDExtra CactusExamples/HelloWorld Carpet/HighOrderWaveTest EinsteinBase/HydroBase EinsteinAnalysis/Hydro_Analysis EinsteinInitialData/Hydro_InitExcision EinsteinInitialData/IDAnalyticBH EinsteinInitialData/IDAxiBrillBH EinsteinInitialData/IDAxiOddBrillBH EinsteinInitialData/IDBrillData EinsteinInitialData/IDConstraintViolate EinsteinInitialData/IDFileADM EinsteinInitialData/IDLinearWaves CactusWave/IDScalarWave CactusWave/IDScalarWaveC CactusWave/IDScalarWaveCXX CactusWave/IDScalarWaveElliptic CactusExamples/IDWaveMoL CactusBase/IOASCII CactusBase/IOBasic CactusPUGHIO/IOHDF5 CactusPUGHIO/IOHDF5Util CactusIO/IOJpeg CactusBase/IOUtil CactusBase/InitBase CactusNumerical/InterpToArray EinsteinExact/KerrSchild ExternalLibraries/LAPACK ExternalLibraries/LORENE CactusNumerical/LocalInterp CactusNumerical/LocalReduce Carpet/LoopControl McLachlan/ML_ADMConstraints McLachlan/ML_ADMQuantities McLachlan/ML_BSSN McLachlan/ML_BSSN_Helper McLachlan/ML_BSSN_Test McLachlan/ML_CCZ4 McLachlan/ML_CCZ4_Helper McLachlan/ML_CCZ4_Test McLachlan/ML_WaveToy McLachlan/ML_WaveToy_Test ExternalLibraries/MPI CactusUtils/MemSpeed EinsteinInitialData/Meudon_Bin_BH EinsteinInitialData/Meudon_Bin_NS EinsteinInitialData/Meudon_Mag_NS EinsteinExact/Minkowski CactusNumerical/MoL EinsteinExact/ModifiedSchwarzschildBL EinsteinAnalysis/Multipole CactusUtils/NaNCatcher CactusUtils/NaNChecker EinsteinEvolve/NewRad CactusUtils/Nice EinsteinInitialData/NoExcision CactusUtils/NoMPI CactusNumerical/Noise CactusNumerical/Norms PITTNullCode/NullConstr PITTNullCode/NullDecomp PITTNullCode/NullEvolve PITTNullCode/NullExact PITTNullCode/NullGrid PITTNullCode/NullInterp PITTNullCode/NullNews PITTNullCode/NullPsiInt PITTNullCode/NullSHRExtract PITTNullCode/NullVars ExternalLibraries/OpenSSL EinsteinAnalysis/Outflow ExternalLibraries/PAPI ExternalLibraries/PETSc CactusPUGH/PUGH CactusPUGH/PUGHInterp CactusPUGH/PUGHReduce CactusPUGH/PUGHSlab CactusNumerical/Periodic LSUThorns/PeriodicCarpet CactusExamples/Poisson AEIThorns/PunctureTracker LSUThorns/QuasiLocalMeasures Carpet/ReductionTest Carpet/ReductionTest2 Carpet/ReductionTest3 CactusNumerical/ReflectionSymmetry Carpet/RegridSyncTest EinsteinInitialData/RotatingDBHIVP CactusNumerical/RotatingSymmetry180 CactusNumerical/RotatingSymmetry90 CactusExamples/SampleBoundary CactusExamples/SampleIO EinsteinUtils/SetMask_SphericalSurface EinsteinExact/ShiftedGaugeWave CactusNumerical/Slab CactusNumerical/SlabTest CactusConnect/Socket CactusNumerical/SpaceMask PITTNullCode/SphericalHarmonicDecomp PITTNullCode/SphericalHarmonicRecon CactusNumerical/SphericalSurface EinsteinBase/StaticConformal LSUThorns/SummationByParts CactusBase/SymBase AEIThorns/SystemStatistics CactusElliptic/TATelliptic EinsteinUtils/TGRtensor EinsteinInitialData/TOVSolver CactusUtils/TerminationTrigger CactusTest/TestArrays Carpet/TestCarpetGridInfo CactusTest/TestComplex CactusTest/TestCoordinates CactusTest/TestFortranCrayPointers CactusTest/TestFortranDependencies1 CactusTest/TestFortranDependencies2 CactusTest/TestFpointerNULL CactusTest/TestFreeF90 CactusTest/TestGlobalReduce CactusTest/TestInclude1 CactusTest/TestInclude2 CactusNumerical/TestLocalReduce CactusTest/TestLoop Carpet/TestLoopControl CactusTest/TestMath CactusTest/TestMoL CactusTest/TestPar CactusTest/TestReduce CactusTest/TestSchedule CactusTest/TestStrings CactusTest/TestTable CactusTest/TestTimers CactusTest/TestTypes CactusBase/Time CactusExamples/TimerInfo CactusUtils/TimerReport Carpet/Timers EinsteinBase/TmunuBase AEIThorns/Trigger EinsteinInitialData/TwoPunctures EinsteinExact/Vaidya2 LSUThorns/Vectors CactusWave/WaveBinarySource CactusExamples/WaveMoL CactusExamples/WaveToy1DF77 CactusExamples/WaveToy2DF77 CactusWave/WaveToyC CactusWave/WaveToyCXX CactusWave/WaveToyExtra CactusWave/WaveToyF77 CactusWave/WaveToyF90 CactusWave/WaveToyFreeF90 EinsteinAnalysis/WeylScal4 ExternalLibraries/hwloc ExternalLibraries/libjpeg ExternalLibraries/zlib /home/jenkins/workspace/EinsteinToolkit/configs/sim/scratch/external/PETSc/lib/libpetsc.a(client.o): In function `PetscSSLInitializeContext': /home/jenkins/workspace/EinsteinToolkit/configs/sim/scratch/build/PETSc/petsc-3.5.2/src/sys/webclient/client.c:56: undefined reference to `SSLv23_method' /home/jenkins/workspace/EinsteinToolkit/configs/sim/scratch/build/PETSc/petsc-3.5.2/src/sys/webclient/client.c:56: undefined reference to `SSL_CTX_new' /home/jenkins/workspace/EinsteinToolkit/configs/sim/scratch/build/PETSc/petsc-3.5.2/src/sys/webclient/client.c:57: undefined reference to `SSL_CTX_ctrl' /home/jenkins/workspace/EinsteinToolkit/configs/sim/scratch/build/PETSc/petsc-3.5.2/src/sys/webclient/client.c:48: undefined reference to `SSL_library_init' /home/jenkins/workspace/EinsteinToolkit/configs/sim/scratch/build/PETSc/petsc-3.5.2/src/sys/webclient/client.c:49: undefined reference to `SSL_load_error_strings' /home/jenkins/workspace/EinsteinToolkit/configs/sim/scratch/build/PETSc/petsc-3.5.2/src/sys/webclient/client.c:50: undefined reference to `BIO_new_fp' /home/jenkins/workspace/EinsteinToolkit/configs/sim/scratch/external/PETSc/lib/libpetsc.a(client.o): In function `PetscSSLDestroyContext': /home/jenkins/workspace/EinsteinToolkit/configs/sim/scratch/build/PETSc/petsc-3.5.2/src/sys/webclient/client.c:87: undefined reference to `SSL_CTX_free' /home/jenkins/workspace/EinsteinToolkit/configs/sim/scratch/external/PETSc/lib/libpetsc.a(client.o): In function `PetscHTTPSRequest': /home/jenkins/workspace/EinsteinToolkit/configs/sim/scratch/build/PETSc/petsc-3.5.2/src/sys/webclient/client.c:179: undefined reference to `SSL_write' /home/jenkins/workspace/EinsteinToolkit/configs/sim/scratch/build/PETSc/petsc-3.5.2/src/sys/webclient/client.c:180: undefined reference to `SSL_get_error' /home/jenkins/workspace/EinsteinToolkit/configs/sim/scratch/build/PETSc/petsc-3.5.2/src/sys/webclient/client.c:197: undefined reference to `SSL_read' /home/jenkins/workspace/EinsteinToolkit/configs/sim/scratch/build/PETSc/petsc-3.5.2/src/sys/webclient/client.c:199: undefined reference to `SSL_get_error' /home/jenkins/workspace/EinsteinToolkit/configs/sim/scratch/build/PETSc/petsc-3.5.2/src/sys/webclient/client.c:232: undefined reference to `SSL_free' /home/jenkins/workspace/EinsteinToolkit/configs/sim/scratch/build/PETSc/petsc-3.5.2/src/sys/webclient/client.c:204: undefined reference to `SSL_shutdown' /home/jenkins/workspace/EinsteinToolkit/configs/sim/scratch/external/PETSc/lib/libpetsc.a(client.o): In function `PetscHTTPSConnect': /home/jenkins/workspace/EinsteinToolkit/configs/sim/scratch/build/PETSc/petsc-3.5.2/src/sys/webclient/client.c:284: undefined reference to `SSL_new' /home/jenkins/workspace/EinsteinToolkit/configs/sim/scratch/build/PETSc/petsc-3.5.2/src/sys/webclient/client.c:285: undefined reference to `BIO_new_socket' /home/jenkins/workspace/EinsteinToolkit/configs/sim/scratch/build/PETSc/petsc-3.5.2/src/sys/webclient/client.c:286: undefined reference to `SSL_set_bio' /home/jenkins/workspace/EinsteinToolkit/configs/sim/scratch/build/PETSc/petsc-3.5.2/src/sys/webclient/client.c:287: undefined reference to `SSL_connect' collect2: ld returned 1 exit status make[1]: *** [/home/jenkins/workspace/EinsteinToolkit/exe/cactus_sim] Error 1 make: *** [sim] Error 2 Build step 'Execute shell' marked build as failure Archiving artifacts Recording test results IRC notifier plugin: Sending notification to: #cactus IRC notifier plugin: [ERROR] not connected. Cannot send message to '#cactus' Email was triggered for: Failure - 1st Email was triggered for: Failure - Any Trigger Failure - Any was overridden by another trigger and will not send an email. Trigger Failure - Still was overridden by another trigger and will not send an email. Sending email for trigger: Failure - 1st