BUILD FAILURE

Build URL:https://build.barrywardell.net/job/EinsteinToolkit/737/
Project:EinsteinToolkit
Date of build:Sun, 24 Apr 2016 20:33:12 +0000
Build duration:31 sec

Changes

Revision: ba70c220383fe804fc91f89c6043839c45d7aa12
Author:Einstein Toolkit Git Server
Log:
Updated submodules:

* arrangements/CactusPUGH 20ddd58...bf338c2 (1):
  > PUGHReduce: fix incorrect bounds computation for grid arrays


Console Output


	[...truncated 2161 lines...]

	********************************************************************************

	Running configuration script for thorn OPENSSL:

	OpenSSL selected, but OPENSSL_DIR not set. Checking some places...

	Found OpenSSL in /usr

	Finished running configuration script for thorn OPENSSL.

	

	********************************************************************************

	Running configuration script for thorn PAPI:

	PAPI selected, but PAPI_DIR not set. Checking some places...

	PAPI not found

	Using bundled PAPI...

	Finished running configuration script for thorn PAPI.

	

	********************************************************************************

	Running configuration script for thorn PTHREADS:

	Finished running configuration script for thorn PTHREADS.

	

	********************************************************************************

	Running configuration script for thorn VECTORS:

	Finished running configuration script for thorn VECTORS.

	

	********************************************************************************

	Running configuration script for thorn ZLIB:

	Finished running configuration script for thorn ZLIB.

	

	********************************************************************************

	Running configuration script for thorn HWLOC:

	hwloc selected, but HWLOC_DIR not set. Checking some places...

	hwloc not found

	Using bundled hwloc...

	Finished running configuration script for thorn HWLOC.

	

	********************************************************************************

	Running configuration script for thorn MPI:

	MPI was manually configured.

	Finished running configuration script for thorn MPI.

	

	********************************************************************************

	Running configuration script for thorn PETSC:

	PETSc selected, but PETSC_DIR not set. Checking some places...

	PETSc not found

	Using bundled PETSc...

	Finished running configuration script for thorn PETSC.

	

	********************************************************************************

	Running configuration script for thorn HDF5:

	Can't open perl script "/home/jenkins/workspace/EinsteinToolkit/arrangements/ExternalLibraries/HDF5/src/detect.pl": No such file or directory

	

	CST error 1:

	-> Configuration script for thorn HDF5 returned exit code 2

	(no error message)

	

	Finished running configuration script for thorn HDF5.

	Checking consistency...

	Creating Thorn-Flesh bindings...

	Creating implementation bindings...

	Creating parameter bindings...

	Creating variable bindings...

	Creating schedule bindings...

	Creating function bindings...

	

	

	------------------------------------------------------

	There was 1 error during execution of the CST

	This must be corrected before compilation can proceed

	------------------------------------------------------

	

	

	

	------------------------------------------------------

	Warnings were generated during execution of the CST

	------------------------------------------------------

	

	

	CST error 1:

	-> Configuration script for thorn HDF5 returned exit code 2

	(no error message)

	

	------------------------------------------------------

	

	make[1]: *** [/home/jenkins/workspace/EinsteinToolkit/configs/sim/config-data/make.thornlist] Error 1

	make: *** [sim] Error 2

	Build step 'Execute shell' marked build as failure

	Archiving artifacts

	Recording test results

	ERROR: Step ‘Publish JUnit test result report’ failed: Test reports were found but none of them are new. Did tests run?

	For example, /home/jenkins/workspace/EinsteinToolkit/testresults.xml is 2 days 0 hr old

	

	IRC notifier plugin: Sending notification to: #cactus

	IRC notifier plugin: [ERROR] not connected. Cannot send message to '#cactus'

	[BFA] Scanning build for known causes...

	[BFA] No failure causes found

	[BFA] Done. 0s

	Started calculate disk usage of build

	Finished Calculation of disk usage of build in 0 seconds

	Started calculate disk usage of workspace

	Finished Calculation of disk usage of workspace in  2 second

	Email was triggered for: Failure - Any

	Sending email for trigger: Failure - Any