BUILD FAILURE
| Build URL: | https://jenkins.einsteintoolkit.ncsa.illinois.edu/job/EinsteinToolkit/1733/ |
| Project: | EinsteinToolkit |
| Date of build: | Mon, 14 Sep 2020 13:05:29 +0000 |
| Build duration: | 1 min 1 sec |
[...truncated 103.22 KB...] Checking status of thorn LeanBSSNMoL Checking status of thorn LocalInterp Checking status of thorn LocalInterp2 Checking status of thorn LocalReduce Checking status of thorn ML_BSSN_Test Checking status of thorn ML_CCZ4_Test Checking status of thorn ML_WaveToy_Test Checking status of thorn Meudon_Bin_BH Checking status of thorn Meudon_Bin_NS Checking status of thorn Meudon_Mag_NS Checking status of thorn MoL Checking status of thorn NPScalars Checking status of thorn NPScalars_Proca Checking status of thorn NaNCatcher Checking status of thorn NaNChecker Checking status of thorn NewRad Checking status of thorn Nice Checking status of thorn Noise Checking status of thorn Norms Checking status of thorn NullDecomp Checking status of thorn NullGrid Checking status of thorn NullVars Checking status of thorn OpenSSL Checking status of thorn Outflow Checking status of thorn PAPI Checking status of thorn TATelliptic Checking status of thorn ProcaBase Checking status of thorn ProcaEvolve Checking status of thorn Proca_simpleID Checking status of thorn PunctureTracker Checking status of thorn ReductionTest Checking status of thorn ReductionTest2 Checking status of thorn ReductionTest3 Checking status of thorn ReflectionSymmetry Checking status of thorn RegridSyncTest Checking status of thorn RotatingDBHIVP Checking status of thorn SampleBoundary Checking status of thorn SampleIO Checking status of thorn Seed_Magnetic_Fields Checking status of thorn Seed_Magnetic_Fields_BNS Checking status of thorn SetMask_SphericalSurface Checking status of thorn SlabTest Checking status of thorn StaticConformal Checking status of thorn SymBase Checking status of thorn SystemStatistics Checking status of thorn TerminationTrigger Checking status of thorn TestArrays Checking status of thorn TestComplex Checking status of thorn TestCoordinates Checking status of thorn TestFortranCrayPointers Checking status of thorn TestFortranDependencies2 Checking status of thorn TestFpointerNULL Checking status of thorn TestFreeF90 Checking status of thorn TestGlobalReduce Checking status of thorn TestInclude1 Checking status of thorn TestInclude2 Checking status of thorn TestLocalInterp2 Checking status of thorn TestLocalReduce Checking status of thorn TestLoop Checking status of thorn TestMath Checking status of thorn TestMoL Checking status of thorn TestPar Checking status of thorn TestReadWrite Checking status of thorn TestReduce Checking status of thorn TestSchedule Checking status of thorn TestStrings Checking status of thorn TestTable Checking status of thorn TestTimers Checking status of thorn TestTypes Checking status of thorn Time Checking status of thorn TimerInfo Checking status of thorn TmunuBase Checking status of thorn Trigger make[3]: *** No rule to make target 'ParamWarn.c.o', needed by 'make.checked'. Stop. make[2]: *** [/home/jenkins/workspace/EinsteinToolkit/lib/make/make.thornlib:113: make.checked] Error 2 make[1]: *** [/home/jenkins/workspace/EinsteinToolkit/lib/make/make.configuration:179: /home/jenkins/workspace/EinsteinToolkit/configs/sim/lib/libthorn_TmunuBase.a] Error 2 make[1]: *** Waiting for unfinished jobs.... make: *** [Makefile:264: sim] Error 2 real 0m53.093s user 0m42.392s sys 0m14.240s real 0m55.278s user 0m44.168s sys 0m14.496s Build step 'Execute shell' marked build as failure Archiving artifacts Recording test results ERROR: Step ?Publish JUnit test result report? failed: Test reports were found but none of them are new. Did leafNodes run? For example, /home/jenkins/workspace/EinsteinToolkit/testresults.xml is 1 day 18 hr old Started calculate disk usage of build Finished Calculation of disk usage of build in 0 seconds Started calculate disk usage of workspace Finished Calculation of disk usage of workspace in 3 second [Checks API] No suitable checks publisher found. Email was triggered for: Failure - Any Sending email for trigger: Failure - Any