BUILD FAILURE
| Build URL: | https://build.barrywardell.net/job/EinsteinToolkit/797/ |
| Project: | EinsteinToolkit |
| Date of build: | Tue, 07 Jun 2016 08:00:55 +0000 |
| Build duration: | 6 min 15 sec |
| Revision: | e901b7fbf885def40b21cb721c65dcb1e1010fc5 |
| Author: | Einstein Toolkit Git Server |
| Log: | Updated submodules: * simfactory 1421d83...d13bafe (2): > New machine Cori (NERSC) > Set grid type in example parameter file |
| Revision: | ef8c5c77be335d6388618b8856c658372f32e9f7 |
| Author: | Einstein Toolkit Git Server |
| Log: | Updated submodules: * arrangements/CactusBase f040ea8...995dd5f (1): > CoordBase: Use CCTK_ERROR where possible * repos/carpet 108934a...1a399d5 (3): > CarpetReduce: Add TODO comment > CarpetReduce: New parameter debug_iweight > CarpetReduce: Use CCTK_ERROR instead of CCTK_WARN |
| Revision: | 120a7e826de33ef4685fc4ea25d9e9c2b770d03b |
| Author: | Einstein Toolkit Git Server |
| Log: | Updated submodules: * arrangements/WVUThorns ddb6bba...74deef3 (1): > IllinoisGRMHD: rho_star<0 fix was only valid when Polytropic Gamma was 2.0, and Polytropic K was 1. Fix this bug. |
| Revision: | 03ee2ff8ab7d2ad9d4fa3f38c119561a02b98c09 |
| Author: | Einstein Toolkit Git Server |
| Log: | Updated submodules: * repos/carpet 1a399d5...2a9affa (1): > CarpetIOASCII: Use CCTK_Error instead of CCTK_Warn |
| Revision: | 4d603fbbcfc64430be11a666b0049cb1f39dde3c |
| Author: | Einstein Toolkit Git Server |
| Log: | Updated submodules: * simfactory d13bafe...4ecdd58 (2): > Update MP2 > Update Blue Waters |
| Revision: | 3c2fcca719d635d88fdbef94b8749395d3c3b767 |
| Author: | Einstein Toolkit Git Server |
| Log: | Updated submodules: * repos/carpet 2a9affa...0c93f54 (5): > CarpetReduce: Correct handling weight storage for debug output > CarpetReduce: Rearrange mask calculation, improve debug output > CarpetReduce: Convert bit handling macros to functions > CarpetLib: Beautify source code in dh.cc > CarpetLib: Handle refined regions next to outer boundaries when calculating reduction weights |
| Revision: | 9afb48e5f995ac32d2626a0153a57ba4f7bf5ef8 |
| Author: | Einstein Toolkit Git Server |
| Log: | Updated submodules: * simfactory 4ecdd58...08f4614 (1): > Ignore Simfactory warnings when determining local machine name |
| Revision: | 583512bd0fbff0316027760ac3e25c29006aa446 |
| Author: | Einstein Toolkit Git Server |
| Log: | Updated submodules: * arrangements/EinsteinInitialData d727a41...36d4719 (1): > Hydro_InitExcision: Remove output that triggered round-off testsuite failures (zero to small non-zero) |
| Revision: | d1a5893e374e910db2e1dc113e61c6825a78d013 |
| Author: | Einstein Toolkit Git Server |
| Log: | Updated submodules: * arrangements/ExternalLibraries/pthreads 6d49acb...f012181 (1): > also look for pthreads in multi-arch directory. Stop-gap measure, should be replaced by something else |
| Revision: | acf280231e584b2e824483596714de0ca6b67c09 |
| Author: | Einstein Toolkit Git Server |
| Log: | Updated submodules: * arrangements/ExternalLibraries/pthreads f012181...0dd633e (2): > add more architectures: lib/i386-linux-gnu lib/arm-linux-gnueabihf > correct x86_64-linux-gnu |
| Revision: | 17ec316b679d65774c1192f5c99dd063261cf10e |
| Author: | Einstein Toolkit Git Server |
| Log: | Updated submodules: * arrangements/ExternalLibraries/FFTW3 fa147ef...fe15e92 (1): > Pass SYS_INC_DIRS and LIBDIRS to configure * arrangements/ExternalLibraries/hwloc fb1dbeb...2a0b74c (1): > Pass SYS_INC_DIRS and LIBDIRS to configure |
| Revision: | e7eed340e6fe3fcce2ef477ff04a181fff6560ba |
| Author: | Einstein Toolkit Git Server |
| Log: | Updated submodules: * simfactory 08f4614...61fad09 (2): > Update Shelob > Expand @USER@ in directory names |
| Revision: | a12df6368eb7eb2dd2b297cc73fa4133b7cf684f |
| Author: | Einstein Toolkit Git Server |
| Log: | Updated submodules: * simfactory 61fad09...347c344 (2): > Update "last tested on" dates > Update SMIC |
| Revision: | fd21c9c6761298b11a2814095125efd9475d0ea5 |
| Author: | Einstein Toolkit Git Server |
| Log: | Updated submodules: * simfactory 347c344...a48f7f0 (1): > Update list of packages required for Ubuntu optionlist |
| Revision: | 3abc3d91f0c7f122e080fbef8192aaf01e1953a6 |
| Author: | Einstein Toolkit Git Server |
| Log: | Updated submodules: * arrangements/ExternalLibraries/PETSc 3c1e0df...2e0fd61 (1): > unset ARFLAGS, workaround for problem with 'u' in ARFLAGS in Cactus (see ticket #1902) |
| Revision: | 7b48189d72b7774749cc2c937d5b6f4d2e0224da |
| Author: | Einstein Toolkit Git Server |
| Log: | Updated submodules: * arrangements/ExternalLibraries/HDF5 8547096...d32ef19 (1): > Update HDF5 to 1.8.17 |
[...truncated 22158 lines...] h5checkerV2_0.c:392:1: warning: no return statement in function returning non-void [-Wreturn-type] h5checkerV2_0.c: In function ‘G_dense_btree2_name_compare’: h5checkerV2_0.c:399:1: warning: no return statement in function returning non-void [-Wreturn-type] h5checkerV2_0.c: In function ‘G_dense_btree2_corder_compare’: h5checkerV2_0.c:405:1: warning: no return statement in function returning non-void [-Wreturn-type] h5checkerV2_0.c: In function ‘SM_message_compare’: h5checkerV2_0.c:411:1: warning: no return statement in function returning non-void [-Wreturn-type] h5checkerV2_0.c: In function ‘A_dense_btree2_name_compare’: h5checkerV2_0.c:417:1: warning: no return statement in function returning non-void [-Wreturn-type] h5checkerV2_0.c: In function ‘A_dense_btree2_corder_compare’: h5checkerV2_0.c:423:1: warning: no return statement in function returning non-void [-Wreturn-type] h5checkerV2_0.c: In function ‘check_bt2_hdr’: h5checkerV2_0.c:462:17: warning: variable ‘logical’ set but not used [-Wunused-but-set-variable] h5checkerV2_0.c:457:29: warning: variable ‘merge_percent’ set but not used [-Wunused-but-set-variable] h5checkerV2_0.c:457:14: warning: variable ‘split_percent’ set but not used [-Wunused-but-set-variable] h5checkerV2_0.c: In function ‘check_bt2_leaf’: h5checkerV2_0.c:610:17: warning: variable ‘logical’ set but not used [-Wunused-but-set-variable] h5checkerV2_0.c: In function ‘check_bt2_internal’: h5checkerV2_0.c:718:25: warning: variable ‘logical’ set but not used [-Wunused-but-set-variable] h5checkerV2_0.c:709:20: warning: unused variable ‘badinfo’ [-Wunused-variable] h5checkerV2_0.c: In function ‘HF_sect_row_init_cls’: h5checkerV2_0.c:1061:1: warning: label ‘done’ defined but not used [-Wunused-label] h5checkerV2_0.c: In function ‘HF_sect_indirect_init_cls’: h5checkerV2_0.c:1077:1: warning: label ‘done’ defined but not used [-Wunused-label] h5checkerV2_0.c: In function ‘check_fssection’: h5checkerV2_0.c:1187:26: warning: unused variable ‘des_flags’ [-Wunused-variable] h5checkerV2_0.c: In function ‘HF_dtable_init’: h5checkerV2_0.c:1397:16: warning: unused variable ‘acc_block_off’ [-Wunused-variable] h5checkerV2_0.c: In function ‘check_iblock_real’: h5checkerV2_0.c:1491:11: warning: unused variable ‘i’ [-Wunused-variable] h5checkerV2_0.c:1490:27: warning: unused variable ‘col’ [-Wunused-variable] h5checkerV2_0.c:1490:22: warning: unused variable ‘row’ [-Wunused-variable] h5checkerV2_0.c:1490:15: warning: unused variable ‘entry’ [-Wunused-variable] h5checkerV2_0.c:1489:15: warning: unused variable ‘dir_rows’ [-Wunused-variable] h5checkerV2_0.c: In function ‘check_dtable’: h5checkerV2_0.c:2069:1: warning: label ‘done’ defined but not used [-Wunused-label] h5checkerV2_0.c: In function ‘HF_huge_get_obj_info’: h5checkerV2_0.c:2567:1: warning: label ‘done’ defined but not used [-Wunused-label] h5checkerV2_0.c: In function ‘HF_get_obj_info’: h5checkerV2_0.c:2627:1: warning: label ‘done’ defined but not used [-Wunused-label] h5checkerV2_0.c: In function ‘HF_huge_read’: h5checkerV2_0.c:2638:15: warning: unused variable ‘filter_mask’ [-Wunused-variable] h5checkerV2_0.c: In function ‘HF_tiny_read’: h5checkerV2_0.c:2827:1: warning: label ‘done’ defined but not used [-Wunused-label] h5checkerV2_0.c:2796:15: warning: unused variable ‘ret_value’ [-Wunused-variable] h5checkerV2_0.c: In function ‘HF_read’: h5checkerV2_0.c:2875:1: warning: label ‘done’ defined but not used [-Wunused-label] h5checkerV2_0.c: In function ‘check_SOHM’: h5checkerV2_0.c:2956:10: warning: unused variable ‘ck_msg_op’ [-Wunused-variable] h5checkerV2_0.c: In function ‘SM_type_to_flag’: h5checkerV2_0.c:3114:1: warning: label ‘done’ defined but not used [-Wunused-label] h5checkerV2_0.c: At top level: h5checkerV2_0.c:84:17: warning: ‘SOHM_ck_msg_cb’ declared ‘static’ but never defined [-Wunused-function] h5checkerV2_0.c: In function ‘HF_close’: h5checkerV2_0.c:2477:1: warning: control reaches end of non-void function [-Wreturn-type] h5checker.c: In function ‘FD_get_eof’: h5checker.c:692:5: warning: ‘ret_value’ may be used uninitialized in this function [-Wuninitialized] h5checker.c: In function ‘check_lheap’: h5checker.c:5096:25: warning: ‘size_free_block’ may be used uninitialized in this function [-Wuninitialized] h5checker.c:5077:4: warning: ‘data_seg_size’ may be used uninitialized in this function [-Wuninitialized] h5checker.c: In function ‘check_obj_header’: h5checker.c:5505:17: warning: ‘name_list’ may be used uninitialized in this function [-Wuninitialized] h5checker.c:5415:18: note: ‘name_list’ was declared here h5checker.c: In function ‘check_btree.constprop.14’: h5checker.c:4829:12: warning: ‘logical’ may be used uninitialized in this function [-Wuninitialized] h5checker.c: In function ‘OBJ_shared_read’: h5checker.c:5825:12: warning: ‘start_buf’ may be used uninitialized in this function [-Wuninitialized] h5checker.c:5825:12: warning: ‘logi_base’ may be used uninitialized in this function [-Wuninitialized] h5checker_main.c: In function ‘main’: h5checker_main.c:30:11: warning: unused variable ‘rest’ [-Wunused-variable] h5checker_main.c:21:12: warning: unused variable ‘inputfd’ [-Wunused-variable] h5checker_main.c:20:15: warning: unused variable ‘gheap_addr’ [-Wunused-variable] HDF5: Installing checker... /usr/bin/install -c h5check '/home/jenkins/workspace/EinsteinToolkit/configs/sim/scratch/external/HDF5/bin' ~/workspace/EinsteinToolkit/configs/sim/scratch HDF5: Cleaning up... HDF5: Done. Updating /home/jenkins/workspace/EinsteinToolkit/configs/sim/lib/libthorn_HDF5.a make: *** [sim] Error 2 Build step 'Execute shell' marked build as failure Archiving artifacts Recording test results ERROR: Step ‘Publish JUnit test result report’ failed: Test reports were found but none of them are new. Did tests run? For example, /home/jenkins/workspace/EinsteinToolkit/testresults.xml is 7 days 13 hr old IRC notifier plugin: Sending notification to: #cactus IRC notifier plugin: [ERROR] not connected. Cannot send message to '#cactus' [BFA] Scanning build for known causes... [BFA] No failure causes found [BFA] Done. 0s Started calculate disk usage of build Finished Calculation of disk usage of build in 0 seconds Started calculate disk usage of workspace Finished Calculation of disk usage of workspace in 27 second Email was triggered for: Failure - 1st Email was triggered for: Failure - Any Trigger Failure - Any was overridden by another trigger and will not send an email. Trigger Failure - Still was overridden by another trigger and will not send an email. Sending email for trigger: Failure - 1st