BUILD FAILURE

Build URL:https://build.barrywardell.net/job/EinsteinToolkit/602/
Project:EinsteinToolkit
Date of build:Sat, 15 Aug 2015 07:16:22 +0000
Build duration:8 min 16 sec

Changes

No changes

Tests

testresults.xml. Failed for 3 builds since build #600 on Fri Aug 14 12:55:24 UTC 2015
0 tests passed

Console Output


	[...truncated 2479 lines...]

	/home/jenkins/workspace/EinsteinToolkit/arrangements/PITTNullCode/SphericalHarmonicRecon/src/util/findlast.c: In function ‘main’:

	/home/jenkins/workspace/EinsteinToolkit/arrangements/PITTNullCode/SphericalHarmonicRecon/src/util/findlast.c:39:10: warning: ignoring return value of ‘freopen’, declared with attribute warn_unused_result [-Wunused-result]

	Compiling /home/jenkins/workspace/EinsteinToolkit/arrangements/PITTNullCode/SphericalHarmonicRecon/src/util/readmeta.c

	Copying hwloc-assembler from /home/jenkins/workspace/EinsteinToolkit/configs/sim/scratch/external/hwloc/bin/hwloc-assembler to /home/jenkins/workspace/EinsteinToolkit/exe/sim

	/home/jenkins/workspace/EinsteinToolkit/arrangements/PITTNullCode/SphericalHarmonicRecon/src/util/fftwfilter.c: In function ‘write_meta’:

	/home/jenkins/workspace/EinsteinToolkit/arrangements/PITTNullCode/SphericalHarmonicRecon/src/util/fftwfilter.c:439:11: warning: variable ‘status’ set but not used [-Wunused-but-set-variable]

	/home/jenkins/workspace/EinsteinToolkit/arrangements/PITTNullCode/SphericalHarmonicRecon/src/util/fftwfilter.c: In function ‘write_out_data_for_component’:

	/home/jenkins/workspace/EinsteinToolkit/arrangements/PITTNullCode/SphericalHarmonicRecon/src/util/fftwfilter.c:492:11: warning: variable ‘status’ set but not used [-Wunused-but-set-variable]

	/home/jenkins/workspace/EinsteinToolkit/arrangements/PITTNullCode/SphericalHarmonicRecon/src/util/fftwfilter.c: In function ‘read_meta’:

	/home/jenkins/workspace/EinsteinToolkit/arrangements/PITTNullCode/SphericalHarmonicRecon/src/util/fftwfilter.c:599:11: warning: variable ‘status’ set but not used [-Wunused-but-set-variable]

	/home/jenkins/workspace/EinsteinToolkit/arrangements/PITTNullCode/SphericalHarmonicRecon/src/util/readmeta.c: In function ‘read_meta’:

	/home/jenkins/workspace/EinsteinToolkit/arrangements/PITTNullCode/SphericalHarmonicRecon/src/util/readmeta.c:27:11: warning: variable ‘status’ set but not used [-Wunused-but-set-variable]

	Copying hwloc-assembler-remote from /home/jenkins/workspace/EinsteinToolkit/configs/sim/scratch/external/hwloc/bin/hwloc-assembler-remote to /home/jenkins/workspace/EinsteinToolkit/exe/sim

	/home/jenkins/workspace/EinsteinToolkit/arrangements/PITTNullCode/SphericalHarmonicRecon/src/util/printtime.c: In function ‘main’:

	/home/jenkins/workspace/EinsteinToolkit/arrangements/PITTNullCode/SphericalHarmonicRecon/src/util/printtime.c:36:15: warning: variable ‘status’ set but not used [-Wunused-but-set-variable]

	Copying hwloc-bind from /usr/bin/hwloc-bind to /home/jenkins/workspace/EinsteinToolkit/exe/sim

	Copying hwloc-calc from /usr/bin/hwloc-calc to /home/jenkins/workspace/EinsteinToolkit/exe/sim

	Copying hwloc-distances from /home/jenkins/workspace/EinsteinToolkit/configs/sim/scratch/external/hwloc/bin/hwloc-distances to /home/jenkins/workspace/EinsteinToolkit/exe/sim

	Copying hwloc-distrib from /usr/bin/hwloc-distrib to /home/jenkins/workspace/EinsteinToolkit/exe/sim

	Copying hwloc-info from /usr/bin/hwloc-info to /home/jenkins/workspace/EinsteinToolkit/exe/sim

	Copying hwloc-ls from /usr/bin/hwloc-ls to /home/jenkins/workspace/EinsteinToolkit/exe/sim

	Copying hwloc-ps from /usr/bin/hwloc-ps to /home/jenkins/workspace/EinsteinToolkit/exe/sim

	Copying lstopo from /usr/bin/lstopo to /home/jenkins/workspace/EinsteinToolkit/exe/sim

	Copying lstopo-no-graphics from /home/jenkins/workspace/EinsteinToolkit/configs/sim/scratch/external/hwloc/bin/lstopo-no-graphics to /home/jenkins/workspace/EinsteinToolkit/exe/sim

	Creating carpet2xgraph in /home/jenkins/workspace/EinsteinToolkit/exe/sim from /home/jenkins/workspace/EinsteinToolkit/configs/sim/build/CarpetIOASCII/carpet2xgraph.o

	Creating hdf5toascii_slicer in /home/jenkins/workspace/EinsteinToolkit/exe/sim from /home/jenkins/workspace/EinsteinToolkit/configs/sim/build/CarpetIOHDF5/hdf5toascii_slicer.o

	Creating hdf5tobinary_slicer in /home/jenkins/workspace/EinsteinToolkit/exe/sim from /home/jenkins/workspace/EinsteinToolkit/configs/sim/build/CarpetIOHDF5/hdf5tobinary_slicer.o

	Creating hdf5_slicer in /home/jenkins/workspace/EinsteinToolkit/exe/sim from /home/jenkins/workspace/EinsteinToolkit/configs/sim/build/CarpetIOHDF5/hdf5_slicer.o

	Creating hdf5_recombiner in /home/jenkins/workspace/EinsteinToolkit/exe/sim from /home/jenkins/workspace/EinsteinToolkit/configs/sim/build/CarpetIOHDF5/hdf5_recombiner.o

	Compiling /home/jenkins/workspace/EinsteinToolkit/configs/sim/build/GRHydro/Riemann1d-main.c

	Creating hdf5_merge in /home/jenkins/workspace/EinsteinToolkit/exe/sim from /home/jenkins/workspace/EinsteinToolkit/configs/sim/build/HDF5/hdf5_merge.o

	Creating hdf5_extract in /home/jenkins/workspace/EinsteinToolkit/exe/sim from /home/jenkins/workspace/EinsteinToolkit/configs/sim/build/HDF5/hdf5_extract.o

	Creating hdf5_double_to_single in /home/jenkins/workspace/EinsteinToolkit/exe/sim from /home/jenkins/workspace/EinsteinToolkit/configs/sim/build/HDF5/hdf5_double_to_single.o

	Creating hdf5_convert_from_carpetiohdf5 in /home/jenkins/workspace/EinsteinToolkit/exe/sim from /home/jenkins/workspace/EinsteinToolkit/configs/sim/build/IOHDF5/hdf5_convert_from_carpetiohdf5.o

	Creating ascii_output in /home/jenkins/workspace/EinsteinToolkit/exe/sim from /home/jenkins/workspace/EinsteinToolkit/configs/sim/build/SphericalHarmonicRecon/ascii_output.o

	Creating fftwfilter in /home/jenkins/workspace/EinsteinToolkit/exe/sim from /home/jenkins/workspace/EinsteinToolkit/configs/sim/build/SphericalHarmonicRecon/fftwfilter.o

	Creating setmeta in /home/jenkins/workspace/EinsteinToolkit/exe/sim from /home/jenkins/workspace/EinsteinToolkit/configs/sim/build/SphericalHarmonicRecon/setmeta.o

	Creating findlast in /home/jenkins/workspace/EinsteinToolkit/exe/sim from /home/jenkins/workspace/EinsteinToolkit/configs/sim/build/SphericalHarmonicRecon/findlast.o

	Creating printtime in /home/jenkins/workspace/EinsteinToolkit/exe/sim from /home/jenkins/workspace/EinsteinToolkit/configs/sim/build/SphericalHarmonicRecon/printtime.o

	Creating readmeta in /home/jenkins/workspace/EinsteinToolkit/exe/sim from /home/jenkins/workspace/EinsteinToolkit/configs/sim/build/SphericalHarmonicRecon/readmeta.o

	Creating Riemann1d in /home/jenkins/workspace/EinsteinToolkit/exe/sim from /home/jenkins/workspace/EinsteinToolkit/configs/sim/build/GRHydro/Riemann1d.o

	Done.

	

	real	7m28.232s

	user	7m50.049s

	sys	4m49.406s

	

	real	7m31.752s

	user	7m52.522s

	sys	4m50.426s

	Skeleton Created

	Job directory: "/home/jenkins/workspace/EinsteinToolkit/../simulations/EinsteinToolkit_874c239c8894caf27fa8c67fdecd1e516a853704_1"

	Option --testsuite given

	Executable: "/home/jenkins/workspace/EinsteinToolkit/exe/cactus_sim"

	Option list: "/home/jenkins/workspace/EinsteinToolkit/../simulations/EinsteinToolkit_874c239c8894caf27fa8c67fdecd1e516a853704_1/SIMFACTORY/cfg/OptionList"

	Submit script: "/home/jenkins/workspace/EinsteinToolkit/../simulations/EinsteinToolkit_874c239c8894caf27fa8c67fdecd1e516a853704_1/SIMFACTORY/run/SubmitScript"

	Run script: "/home/jenkins/workspace/EinsteinToolkit/../simulations/EinsteinToolkit_874c239c8894caf27fa8c67fdecd1e516a853704_1/SIMFACTORY/run/RunScript"

	Simulation name: EinsteinToolkit_874c239c8894caf27fa8c67fdecd1e516a853704_1

	Assigned restart id: 0

	Copying testsuite data

	Traceback (most recent call last):

	File "simfactory/bin/../lib/sim.py", line 148, in <module>

	main()

	File "simfactory/bin/../lib/sim.py", line 144, in main

	CommandDispatch()

	File "simfactory/bin/../lib/sim.py", line 106, in CommandDispatch

	module.main()

	File "/home/jenkins/workspace/EinsteinToolkit/simfactory/lib/sim-manage.py", line 397, in main

	CommandDispatch()

	File "/home/jenkins/workspace/EinsteinToolkit/simfactory/lib/sim-manage.py", line 376, in CommandDispatch

	exec("command_%s()" % command)

	File "<string>", line 1, in <module>

	File "/home/jenkins/workspace/EinsteinToolkit/simfactory/lib/sim-manage.py", line 183, in command_create_run

	command_run()

	File "/home/jenkins/workspace/EinsteinToolkit/simfactory/lib/sim-manage.py", line 220, in command_run

	restart.userRun(simulationName)

	File "/home/jenkins/workspace/EinsteinToolkit/simfactory/lib/simrestart.py", line 960, in userRun

	self.copyTestsuiteData()

	File "/home/jenkins/workspace/EinsteinToolkit/simfactory/lib/simrestart.py", line 494, in copyTestsuiteData

	rsyncversion = simlib.RsyncVersion(rsyncInfo)

	File "/home/jenkins/workspace/EinsteinToolkit/simfactory/lib/simlib.py", line 1073, in RsyncVersion

	versionText, rc = ExecuteCommand('%s --version' % rsynccmd, True)

	File "/home/jenkins/workspace/EinsteinToolkit/simfactory/lib/simlib.py", line 563, in ExecuteCommand

	signal = ret & 0xff

	TypeError: unsupported operand type(s) for &: 'NoneType' and 'int'

	Build step 'Execute shell' marked build as failure

	Archiving artifacts

	Recording test results

	IRC notifier plugin: Sending notification to: #cactus

	IRC notifier plugin: [ERROR] not connected. Cannot send message to '#cactus'

	[BFA] Scanning build for known causes...

	[BFA] No failure causes found

	[BFA] Done. 0s

	Started calculate disk usage of build

	Finished Calculation of disk usage of build in 0 seconds

	Started calculate disk usage of workspace

	Finished Calculation of disk usage of workspace in  5 minutes

	Email was triggered for: Failure - Any

	Sending email for trigger: Failure - Any