BUILD FAILURE

Build URL:https://build.barrywardell.net/job/EinsteinToolkit/982/
Project:EinsteinToolkit
Date of build:Wed, 18 Dec 2013 23:02:10 +0000
Build duration:36 min

Changes

Revision: 3b1660e942d34b9396062bbd2ef4c8ebb77d6b04
Author:Einstein Toolkit Git Server
Log:
Updated submodules:

* flesh 7effe02...ab16dc7 (1):
  > Added POD documentation for RunTestUtils.pl script.


Console Output


	[...truncated 6235 lines...]

	grid::coordinates.norm2.asc: differences below tolerance on 1 lines

	

	

	

	Success: 9 files compared, 6 differ in the last digits

	

	------------------------------------------------------------------------

	

	Test CarpetIOScalar: coords3

	"Carpet/CarpetIOScalar/test/coords3.par"

	

	Issuing ln -fns . output-0000-active && mkdir -p SIMFACTORY && TESTSUITE_PARFILE=/home/jenkins/workspace/simulations/EinsteinToolkit_3b1660e942d34b9396062bbd2ef4c8ebb77d6b04_1/output-0000/arrangements/Carpet/CarpetIOScalar/test/coords3.par /home/jenkins/workspace/EinsteinToolkit/../simulations/EinsteinToolkit_3b1660e942d34b9396062bbd2ef4c8ebb77d6b04_1/output-0000/SIMFACTORY/RunScript

	

	r.average.asc: differences below tolerance on 1 lines

	r.iaverage.asc: differences below tolerance on 1 lines

	r.inorm1.asc: differences below tolerance on 1 lines

	r.norm1.asc: differences below tolerance on 1 lines

	x.average.asc: differences below tolerance on 1 lines

	x.iaverage.asc: differences below tolerance on 1 lines

	y.average.asc: differences below tolerance on 1 lines

	y.iaverage.asc: differences below tolerance on 1 lines

	y.inorm2.asc: differences below tolerance on 1 lines

	y.norm2.asc: differences below tolerance on 1 lines

	

	

	

	Success: 36 files compared, 10 differ in the last digits

	

	------------------------------------------------------------------------

	

	Test CarpetIOScalar: coords4

	"Carpet/CarpetIOScalar/test/coords4.par"

	

	Issuing ln -fns . output-0000-active && mkdir -p SIMFACTORY && TESTSUITE_PARFILE=/home/jenkins/workspace/simulations/EinsteinToolkit_3b1660e942d34b9396062bbd2ef4c8ebb77d6b04_1/output-0000/arrangements/Carpet/CarpetIOScalar/test/coords4.par /home/jenkins/workspace/EinsteinToolkit/../simulations/EinsteinToolkit_3b1660e942d34b9396062bbd2ef4c8ebb77d6b04_1/output-0000/SIMFACTORY/RunScript

	FATAL: Unable to delete script file /tmp/hudson3671888618760757851.sh

	hudson.util.IOException2: remote file operation failed: /tmp/hudson3671888618760757851.sh at hudson.remoting.Channel@423777c8:caltech

	at hudson.FilePath.act(FilePath.java:906)

	at hudson.FilePath.act(FilePath.java:883)

	at hudson.FilePath.delete(FilePath.java:1268)

	at hudson.tasks.CommandInterpreter.perform(CommandInterpreter.java:101)

	at hudson.tasks.CommandInterpreter.perform(CommandInterpreter.java:60)

	at hudson.tasks.BuildStepMonitor$1.perform(BuildStepMonitor.java:19)

	at hudson.model.AbstractBuild$AbstractBuildExecution.perform(AbstractBuild.java:780)

	at hudson.model.Build$BuildExecution.build(Build.java:199)

	at hudson.model.Build$BuildExecution.doRun(Build.java:160)

	at hudson.model.AbstractBuild$AbstractBuildExecution.run(AbstractBuild.java:565)

	at hudson.model.Run.execute(Run.java:1592)

	at hudson.model.FreeStyleBuild.run(FreeStyleBuild.java:46)

	at hudson.model.ResourceController.execute(ResourceController.java:88)

	at hudson.model.Executor.run(Executor.java:237)

	Caused by: hudson.remoting.ChannelClosedException: channel is already closed

	at hudson.remoting.Channel.send(Channel.java:516)

	at hudson.remoting.Request.call(Request.java:129)

	at hudson.remoting.Channel.call(Channel.java:714)

	at hudson.FilePath.act(FilePath.java:899)

	... 13 more

	Caused by: java.io.IOException: Unexpected termination of the channel

	at hudson.remoting.SynchronousCommandTransport$ReaderThread.run(SynchronousCommandTransport.java:50)

	Caused by: java.io.EOFException

	at java.io.ObjectInputStream$BlockDataInputStream.peekByte(ObjectInputStream.java:2595)

	at java.io.ObjectInputStream.readObject0(ObjectInputStream.java:1315)

	at java.io.ObjectInputStream.readObject(ObjectInputStream.java:369)

	at hudson.remoting.Command.readFrom(Command.java:92)

	at hudson.remoting.ClassicCommandTransport.read(ClassicCommandTransport.java:71)

	at hudson.remoting.SynchronousCommandTransport$ReaderThread.run(SynchronousCommandTransport.java:48)

	FATAL: hudson.remoting.RequestAbortedException: java.io.IOException: Unexpected termination of the channel

	hudson.remoting.RequestAbortedException: hudson.remoting.RequestAbortedException: java.io.IOException: Unexpected termination of the channel

	at hudson.remoting.RequestAbortedException.wrapForRethrow(RequestAbortedException.java:41)

	at hudson.remoting.RequestAbortedException.wrapForRethrow(RequestAbortedException.java:34)

	at hudson.remoting.Request.call(Request.java:174)

	at hudson.remoting.Channel.call(Channel.java:714)

	at hudson.remoting.RemoteInvocationHandler.invoke(RemoteInvocationHandler.java:167)

	at sun.proxy.$Proxy56.join(Unknown Source)

	at hudson.Launcher$RemoteLauncher$ProcImpl.join(Launcher.java:925)

	at hudson.Launcher$ProcStarter.join(Launcher.java:360)

	at hudson.tasks.CommandInterpreter.perform(CommandInterpreter.java:91)

	at hudson.tasks.CommandInterpreter.perform(CommandInterpreter.java:60)

	at hudson.tasks.BuildStepMonitor$1.perform(BuildStepMonitor.java:19)

	at hudson.model.AbstractBuild$AbstractBuildExecution.perform(AbstractBuild.java:780)

	at hudson.model.Build$BuildExecution.build(Build.java:199)

	at hudson.model.Build$BuildExecution.doRun(Build.java:160)

	at hudson.model.AbstractBuild$AbstractBuildExecution.run(AbstractBuild.java:565)

	at hudson.model.Run.execute(Run.java:1592)

	at hudson.model.FreeStyleBuild.run(FreeStyleBuild.java:46)

	at hudson.model.ResourceController.execute(ResourceController.java:88)

	at hudson.model.Executor.run(Executor.java:237)

	Caused by: hudson.remoting.RequestAbortedException: java.io.IOException: Unexpected termination of the channel

	at hudson.remoting.Request.abort(Request.java:299)

	at hudson.remoting.Channel.terminate(Channel.java:774)

	at hudson.remoting.SynchronousCommandTransport$ReaderThread.run(SynchronousCommandTransport.java:69)

	Caused by: java.io.IOException: Unexpected termination of the channel

	at hudson.remoting.SynchronousCommandTransport$ReaderThread.run(SynchronousCommandTransport.java:50)

	Caused by: java.io.EOFException

	at java.io.ObjectInputStream$BlockDataInputStream.peekByte(ObjectInputStream.java:2595)

	at java.io.ObjectInputStream.readObject0(ObjectInputStream.java:1315)

	at java.io.ObjectInputStream.readObject(ObjectInputStream.java:369)

	at hudson.remoting.Command.readFrom(Command.java:92)

	at hudson.remoting.ClassicCommandTransport.read(ClassicCommandTransport.java:71)

	at hudson.remoting.SynchronousCommandTransport$ReaderThread.run(SynchronousCommandTransport.java:48)