BUILD FAILURE
Changes
| Revision: |
da3b85605153d31ed246cd22d72c3209a8499ed6 |
| Author: | Einstein Toolkit Git Server |
| Log: | Updated submodules:
* manifest fe11311...1de12bc (1):
> activate pthreads thorn
|
Console Output
[...truncated 345 lines...]
checking for C++ auto specifier... yes
checking for C++ lambda expressions... yes
checking for C++ range-based for statements... yes
checking for Fortran REAL*4... yes
checking for Fortran REAL*8... yes
checking for Fortran REAL*16... yes
checking for Fortran COMPLEX*8... yes
checking for Fortran COMPLEX*16... yes
checking for Fortran COMPLEX*32... yes
checking for cxxabi.h... yes
checking for __cxa_demangle... yes
checking for Dl_info.dli_sname... yes
checking for dladdr... no
checking for dladdr in library dl... yes
checking for backtrace... yes
checking for backtrace_symbols... yes
checking for crypt... no
checking for crypt in library crypt... yes
checking for finite in header math.h and library m... yes
checking for copysign in header math.h and library m... yes
checking for fpclassify in header math.h and library m... yes
checking for isfinite in header math.h and library m... yes
checking for isinf in header math.h and library m... yes
checking for isnan in header math.h and library m... yes
checking for isnormal in header math.h and library m... yes
checking for signbit in header math.h and library m... yes
checking for mkstemp... yes
checking for va_copy... yes
creating cctk_Archdefs.h
creating make.arch.defn
creating cctk_Extradefs.h
creating make.extra.defn
cctk_Archdefs.h is unchanged
make.arch.defn is unchanged
updating cache ./config.cache
creating ./config.status
creating make.config.defn
creating make.config.deps
creating make.config.rules
creating cctk_Config.h
cctk_Config.h is unchanged
Determining number of fortran underscores...
Compiling test file with gfortran -g3 -fcray-pointer -ffixed-line-length-none -ffree-line-length-none ...
Lowercase - One trailing underscore
Compiling test file with gfortran -g3 -fcray-pointer -ffixed-line-length-none -ffree-line-length-none ...
Lowercase - One trailing underscore
Use make sim to build the configuration.
Build step 'Execute shell' marked build as failure
Archiving artifacts
Recording test results
ERROR: Publisher hudson.tasks.junit.JUnitResultArchiver aborted due to exception
hudson.AbortException: Test reports were found but none of them are new. Did tests run?
For example, /home/jenkins/workspace/EinsteinToolkit/testresults.xml is 13 hr old
at hudson.tasks.junit.TestResult.parse(TestResult.java:178)
at hudson.tasks.junit.TestResult.parse(TestResult.java:146)
at hudson.tasks.junit.TestResult.<init>(TestResult.java:122)
at hudson.tasks.junit.JUnitParser$ParseResultCallable.invoke(JUnitParser.java:119)
at hudson.tasks.junit.JUnitParser$ParseResultCallable.invoke(JUnitParser.java:93)
at hudson.FilePath$FileCallableWrapper.call(FilePath.java:2688)
at hudson.remoting.UserRequest.perform(UserRequest.java:121)
at hudson.remoting.UserRequest.perform(UserRequest.java:49)
at hudson.remoting.Request$2.run(Request.java:325)
at hudson.remoting.InterceptingExecutorService$1.call(InterceptingExecutorService.java:68)
at java.util.concurrent.FutureTask$Sync.innerRun(FutureTask.java:334)
at java.util.concurrent.FutureTask.run(FutureTask.java:166)
at java.util.concurrent.ThreadPoolExecutor.runWorker(ThreadPoolExecutor.java:1146)
at java.util.concurrent.ThreadPoolExecutor$Worker.run(ThreadPoolExecutor.java:615)
at java.lang.Thread.run(Thread.java:701)
at ......remote call to cct(Native Method)
at hudson.remoting.Channel.attachCallSiteStackTrace(Channel.java:1360)
at hudson.remoting.UserResponse.retrieve(UserRequest.java:221)
at hudson.remoting.Channel.call(Channel.java:753)
at hudson.FilePath.act(FilePath.java:978)
at hudson.FilePath.act(FilePath.java:967)
at hudson.tasks.junit.JUnitParser.parseResult(JUnitParser.java:90)
at hudson.tasks.junit.JUnitResultArchiver.parse(JUnitResultArchiver.java:120)
at hudson.tasks.junit.JUnitResultArchiver.perform(JUnitResultArchiver.java:137)
at hudson.tasks.BuildStepCompatibilityLayer.perform(BuildStepCompatibilityLayer.java:74)
at hudson.tasks.BuildStepMonitor$1.perform(BuildStepMonitor.java:20)
at hudson.model.AbstractBuild$AbstractBuildExecution.perform(AbstractBuild.java:761)
at hudson.model.AbstractBuild$AbstractBuildExecution.performAllBuildSteps(AbstractBuild.java:721)
at hudson.model.Build$BuildExecution.post2(Build.java:183)
at hudson.model.AbstractBuild$AbstractBuildExecution.post(AbstractBuild.java:670)
at hudson.model.Run.execute(Run.java:1766)
at hudson.model.FreeStyleBuild.run(FreeStyleBuild.java:43)
at hudson.model.ResourceController.execute(ResourceController.java:98)
at hudson.model.Executor.run(Executor.java:374)
IRC notifier plugin: Sending notification to: #cactus
IRC notifier plugin: [ERROR] not connected. Cannot send message to '#cactus'
[BFA] Scanning build for known causes...
[BFA] No failure causes found
[BFA] Done. 0s
Started calculate disk usage of build
Finished Calculation of disk usage of build in 0 seconds
Started calculate disk usage of workspace
Finished Calculation of disk usage of workspace in 5 minutes
Email was triggered for: Failure - Any
Sending email for trigger: Failure - Any