BUILD FAILURE

Build URL:https://build.barrywardell.net/job/EinsteinToolkit/1312/
Project:EinsteinToolkit
Date of build:Fri, 19 Sep 2014 12:19:30 +0000
Build duration:10 min

Changes

Revision: 5316646f3ce170bb3924dd57f738b5f9a03531ef
Author:Einstein Toolkit Git Server
Log:
Updated submodules:

* arrangements/ExternalLibraries/MPI 89ae58e...cb52eca (2):
  > ticket 1653: ExternalLibraries/MPI missing C++ library names
  > One last little problem with NO_BUILD

* flesh 599bf2a...f0ff417 (1):
  > Ticket 1651: Applying write-after-read patch.

* manifest 79d25a6...0d6f2c5 (1):
  > Fix typo so TATElliptic gets checked out correctly.

* repos/Kranc 2f41ff5...5e7c7b8 (8):
  > Work around bug in Mathematica 10
  > Rename Parse to ParsePEG for compatibility with Mathematica 10
  > Add missing local variable declaration
  > Regenerate SimpleWaveScriptCaKernel example
  > Convert Where values back to symbols
  > Regenerate SimpleWaveScriptCaKernel
  > Support boundaries for CaKernel thorns
  > Regenerate SimpleWaveScriptCaKernel example
Revision: a639fc5731c04d0ace7e147133c453e5b82ad5bb
Author:Einstein Toolkit Git Server
Log:
Updated submodules:

* arrangements/ExternalLibraries/MPI cb52eca...097f8a1 (1):
  > Bug #1652: Change pattern from \w to \S in order to allow matching of dashes.

* simfactory 93e2f81...2d844d6 (1):
  > Bug #1517: Make Simfactory tell you what it's doing.

Tests

testresults.xml. New failure
0 tests passed

Console Output


	[...truncated 2516 lines...]

	/home/jenkins/workspace/EinsteinToolkit/arrangements/PITTNullCode/SphericalHarmonicRecon/src/util/findlast.c: In function ‘main’:

	/home/jenkins/workspace/EinsteinToolkit/arrangements/PITTNullCode/SphericalHarmonicRecon/src/util/findlast.c:39:10: warning: ignoring return value of ‘freopen’, declared with attribute warn_unused_result [-Wunused-result]

	Compiling /home/jenkins/workspace/EinsteinToolkit/arrangements/PITTNullCode/SphericalHarmonicRecon/src/util/readmeta.c

	/home/jenkins/workspace/EinsteinToolkit/arrangements/PITTNullCode/SphericalHarmonicRecon/src/util/fftwfilter.c: In function ‘write_meta’:

	/home/jenkins/workspace/EinsteinToolkit/arrangements/PITTNullCode/SphericalHarmonicRecon/src/util/fftwfilter.c:439:11: warning: variable ‘status’ set but not used [-Wunused-but-set-variable]

	/home/jenkins/workspace/EinsteinToolkit/arrangements/PITTNullCode/SphericalHarmonicRecon/src/util/fftwfilter.c: In function ‘write_out_data_for_component’:

	/home/jenkins/workspace/EinsteinToolkit/arrangements/PITTNullCode/SphericalHarmonicRecon/src/util/fftwfilter.c:492:11: warning: variable ‘status’ set but not used [-Wunused-but-set-variable]

	/home/jenkins/workspace/EinsteinToolkit/arrangements/PITTNullCode/SphericalHarmonicRecon/src/util/fftwfilter.c: In function ‘read_meta’:

	/home/jenkins/workspace/EinsteinToolkit/arrangements/PITTNullCode/SphericalHarmonicRecon/src/util/fftwfilter.c:599:11: warning: variable ‘status’ set but not used [-Wunused-but-set-variable]

	Copying hwloc-assembler from /home/jenkins/workspace/EinsteinToolkit/configs/sim/scratch/external/hwloc/bin/hwloc-assembler to /home/jenkins/workspace/EinsteinToolkit/exe/sim

	/home/jenkins/workspace/EinsteinToolkit/arrangements/PITTNullCode/SphericalHarmonicRecon/src/util/printtime.c: In function ‘main’:

	/home/jenkins/workspace/EinsteinToolkit/arrangements/PITTNullCode/SphericalHarmonicRecon/src/util/printtime.c:36:15: warning: variable ‘status’ set but not used [-Wunused-but-set-variable]

	Copying hwloc-assembler-remote from /home/jenkins/workspace/EinsteinToolkit/configs/sim/scratch/external/hwloc/bin/hwloc-assembler-remote to /home/jenkins/workspace/EinsteinToolkit/exe/sim

	/home/jenkins/workspace/EinsteinToolkit/arrangements/PITTNullCode/SphericalHarmonicRecon/src/util/readmeta.c: In function ‘read_meta’:

	/home/jenkins/workspace/EinsteinToolkit/arrangements/PITTNullCode/SphericalHarmonicRecon/src/util/readmeta.c:27:11: warning: variable ‘status’ set but not used [-Wunused-but-set-variable]

	Copying hwloc-bind from /usr/bin/hwloc-bind to /home/jenkins/workspace/EinsteinToolkit/exe/sim

	Copying hwloc-calc from /usr/bin/hwloc-calc to /home/jenkins/workspace/EinsteinToolkit/exe/sim

	Copying hwloc-distances from /home/jenkins/workspace/EinsteinToolkit/configs/sim/scratch/external/hwloc/bin/hwloc-distances to /home/jenkins/workspace/EinsteinToolkit/exe/sim

	Copying hwloc-distrib from /usr/bin/hwloc-distrib to /home/jenkins/workspace/EinsteinToolkit/exe/sim

	Copying hwloc-info from /usr/bin/hwloc-info to /home/jenkins/workspace/EinsteinToolkit/exe/sim

	Copying hwloc-ls from /usr/bin/hwloc-ls to /home/jenkins/workspace/EinsteinToolkit/exe/sim

	Copying hwloc-ps from /usr/bin/hwloc-ps to /home/jenkins/workspace/EinsteinToolkit/exe/sim

	Copying lstopo from /usr/bin/lstopo to /home/jenkins/workspace/EinsteinToolkit/exe/sim

	Copying lstopo-no-graphics from /home/jenkins/workspace/EinsteinToolkit/configs/sim/scratch/external/hwloc/bin/lstopo-no-graphics to /home/jenkins/workspace/EinsteinToolkit/exe/sim

	Creating carpet2xgraph in /home/jenkins/workspace/EinsteinToolkit/exe/sim from /home/jenkins/workspace/EinsteinToolkit/configs/sim/build/CarpetIOASCII/carpet2xgraph.o

	Creating hdf5toascii_slicer in /home/jenkins/workspace/EinsteinToolkit/exe/sim from /home/jenkins/workspace/EinsteinToolkit/configs/sim/build/CarpetIOHDF5/hdf5toascii_slicer.o

	Creating hdf5tobinary_slicer in /home/jenkins/workspace/EinsteinToolkit/exe/sim from /home/jenkins/workspace/EinsteinToolkit/configs/sim/build/CarpetIOHDF5/hdf5tobinary_slicer.o

	Creating hdf5_slicer in /home/jenkins/workspace/EinsteinToolkit/exe/sim from /home/jenkins/workspace/EinsteinToolkit/configs/sim/build/CarpetIOHDF5/hdf5_slicer.o

	Creating hdf5_recombiner in /home/jenkins/workspace/EinsteinToolkit/exe/sim from /home/jenkins/workspace/EinsteinToolkit/configs/sim/build/CarpetIOHDF5/hdf5_recombiner.o

	Creating Riemann1d in /home/jenkins/workspace/EinsteinToolkit/exe/sim from /home/jenkins/workspace/EinsteinToolkit/configs/sim/build/GRHydro/Riemann1d.o

	Creating hdf5_merge in /home/jenkins/workspace/EinsteinToolkit/exe/sim from /home/jenkins/workspace/EinsteinToolkit/configs/sim/build/HDF5/hdf5_merge.o

	Creating hdf5_extract in /home/jenkins/workspace/EinsteinToolkit/exe/sim from /home/jenkins/workspace/EinsteinToolkit/configs/sim/build/HDF5/hdf5_extract.o

	Creating hdf5_double_to_single in /home/jenkins/workspace/EinsteinToolkit/exe/sim from /home/jenkins/workspace/EinsteinToolkit/configs/sim/build/HDF5/hdf5_double_to_single.o

	Creating hdf5_convert_from_carpetiohdf5 in /home/jenkins/workspace/EinsteinToolkit/exe/sim from /home/jenkins/workspace/EinsteinToolkit/configs/sim/build/IOHDF5/hdf5_convert_from_carpetiohdf5.o

	Creating ascii_output in /home/jenkins/workspace/EinsteinToolkit/exe/sim from /home/jenkins/workspace/EinsteinToolkit/configs/sim/build/SphericalHarmonicRecon/ascii_output.o

	Creating fftwfilter in /home/jenkins/workspace/EinsteinToolkit/exe/sim from /home/jenkins/workspace/EinsteinToolkit/configs/sim/build/SphericalHarmonicRecon/fftwfilter.o

	Creating setmeta in /home/jenkins/workspace/EinsteinToolkit/exe/sim from /home/jenkins/workspace/EinsteinToolkit/configs/sim/build/SphericalHarmonicRecon/setmeta.o

	Creating findlast in /home/jenkins/workspace/EinsteinToolkit/exe/sim from /home/jenkins/workspace/EinsteinToolkit/configs/sim/build/SphericalHarmonicRecon/findlast.o

	Creating printtime in /home/jenkins/workspace/EinsteinToolkit/exe/sim from /home/jenkins/workspace/EinsteinToolkit/configs/sim/build/SphericalHarmonicRecon/printtime.o

	Creating readmeta in /home/jenkins/workspace/EinsteinToolkit/exe/sim from /home/jenkins/workspace/EinsteinToolkit/configs/sim/build/SphericalHarmonicRecon/readmeta.o

	Done.

	

	real	4m4.239s

	user	3m10.776s

	sys	3m35.493s

	

	real	4m8.169s

	user	3m13.112s

	sys	3m36.494s

	Skeleton Created

	Job directory: "/home/jenkins/workspace/EinsteinToolkit/../simulations/EinsteinToolkit_a639fc5731c04d0ace7e147133c453e5b82ad5bb_1"

	Option --testsuite given

	Executable: "/home/jenkins/workspace/EinsteinToolkit/exe/cactus_sim"

	Option list: "/home/jenkins/workspace/EinsteinToolkit/../simulations/EinsteinToolkit_a639fc5731c04d0ace7e147133c453e5b82ad5bb_1/SIMFACTORY/cfg/OptionList"

	Submit script: "/home/jenkins/workspace/EinsteinToolkit/../simulations/EinsteinToolkit_a639fc5731c04d0ace7e147133c453e5b82ad5bb_1/SIMFACTORY/run/SubmitScript"

	Run script: "/home/jenkins/workspace/EinsteinToolkit/../simulations/EinsteinToolkit_a639fc5731c04d0ace7e147133c453e5b82ad5bb_1/SIMFACTORY/run/RunScript"

	Simulation name: EinsteinToolkit_a639fc5731c04d0ace7e147133c453e5b82ad5bb_1

	Assigned restart id: 0

	Copying testsuite data

	Traceback (most recent call last):

	File "simfactory/bin/../lib/sim.py", line 148, in <module>

	main()

	File "simfactory/bin/../lib/sim.py", line 144, in main

	CommandDispatch()

	File "simfactory/bin/../lib/sim.py", line 106, in CommandDispatch

	module.main()

	File "/home/jenkins/workspace/EinsteinToolkit/simfactory/lib/sim-manage.py", line 397, in main

	CommandDispatch()

	File "/home/jenkins/workspace/EinsteinToolkit/simfactory/lib/sim-manage.py", line 376, in CommandDispatch

	exec("command_%s()" % command)

	File "<string>", line 1, in <module>

	File "/home/jenkins/workspace/EinsteinToolkit/simfactory/lib/sim-manage.py", line 183, in command_create_run

	command_run()

	File "/home/jenkins/workspace/EinsteinToolkit/simfactory/lib/sim-manage.py", line 220, in command_run

	restart.userRun(simulationName)

	File "/home/jenkins/workspace/EinsteinToolkit/simfactory/lib/simrestart.py", line 956, in userRun

	self.copyTestsuiteData()

	File "/home/jenkins/workspace/EinsteinToolkit/simfactory/lib/simrestart.py", line 494, in copyTestsuiteData

	rsyncversion = simlib.RsyncVersion(rsyncInfo)

	File "/home/jenkins/workspace/EinsteinToolkit/simfactory/lib/simlib.py", line 1055, in RsyncVersion

	versionText = ExecuteCommand('%s --version' % rsynccmd, True)

	File "/home/jenkins/workspace/EinsteinToolkit/simfactory/lib/simlib.py", line 545, in ExecuteCommand

	if (not output) or (global_dict['VERBOSE']):

	KeyError: 'VERBOSE'

	Build step 'Execute shell' marked build as failure

	Archiving artifacts

	Recording test results

	IRC notifier plugin: Sending notification to: #cactus

	IRC notifier plugin: [ERROR] not connected. Cannot send message to '#cactus'

	Email was triggered for: Failure - 1st

	Email was triggered for: Test Regression

	Email was triggered for: Failure - Any

	Trigger Unstable (Test Failures) was overridden by another trigger and will not send an email.

	Trigger Unstable (Test Failures) - Still was overridden by another trigger and will not send an email.

	Trigger Failure - Any was overridden by another trigger and will not send an email.

	Trigger Failure - Still was overridden by another trigger and will not send an email.

	Sending email for trigger: Test Regression

	Sending email to: test@einsteintoolkit.org

	Sending email for trigger: Failure - 1st