BUILD FAILURE

Build URL:https://build.barrywardell.net/job/EinsteinToolkit/749/
Project:EinsteinToolkit
Date of build:Thu, 28 Apr 2016 19:39:08 +0000
Build duration:7 min 12 sec

Changes

Revision: bce8966da161f2888f98019d60b0313dbfd4471e
Author:Einstein Toolkit Git Server
Log:
Updated submodules:

* repos/McLachlan 70863af...fc6cf0e (1):
  > McLachlan: Do no call SetSourceLanguage any more


Console Output


	[...truncated 2380 lines...]

	Checking status of thorn Vaidya2

	Checking status of thorn WaveMoL

	Checking status of thorn WaveToyC

	Checking status of thorn WaveToyCXX

	Checking status of thorn WaveToyF77

	Checking status of thorn WaveToyF90

	Checking status of thorn WaveToyFreeF90

	Checking status of thorn WeylScal4

	Checking status of thorn ADMAnalysis

	Checking status of thorn ADMBase

	Checking status of thorn AHFinder

	Checking status of thorn MPI

	Checking status of thorn CT_Analytic

	Checking status of thorn EOS_Hybrid

	Checking status of thorn PETSc

	Checking status of thorn PUGH

	Checking status of thorn Formaline

	Checking status of thorn HTTPD

	Checking status of thorn MemSpeed

	Checking status of thorn NoMPI

	Checking status of thorn NullEvolve

	Checking status of thorn NullNews

	Checking status of thorn PUGHInterp

	Checking status of thorn PUGHReduce

	Checking status of thorn PUGHSlab

	Checking status of thorn Slab

	Checking status of thorn QuasiLocalMeasures

	Checking status of thorn SystemTopology

	Checking status of thorn TimerReport

	Checking status of thorn Cactus

	/home/jenkins/workspace/EinsteinToolkit/arrangements/EinsteinAnalysis/QuasiLocalMeasures/src/qlm_import_surface.F90:96:2: warning: #warning "TODO: Ensure that the surface parameters don't change" [-Wcpp]

	Checking status of thorn HDF5

	Checking status of thorn CarpetLib

	Checking status of thorn EllPETSc

	Checking status of thorn HTTPDExtra

	Checking status of thorn IOHDF5Util

	Checking status of thorn Multipole

	Checking status of thorn NullConstr

	Checking status of thorn NullExact

	Checking status of thorn NullPsiInt

	Checking status of thorn NullSHRExtract

	Checking status of thorn Periodic

	Checking status of thorn RotatingSymmetry180

	Checking status of thorn RotatingSymmetry90

	Checking status of thorn SphericalHarmonicDecomp

	Checking status of thorn SphericalHarmonicRecon

	Checking status of thorn SphericalHarmonicReconGen

	Checking status of thorn AHFinderDirect

	Checking status of thorn Timers

	Checking status of thorn EOS_Omni

	Checking status of thorn IOHDF5

	Checking status of thorn Carpet

	Checking status of thorn GRHydro_InitData

	Checking status of thorn IllinoisGRMHD

	/home/jenkins/workspace/EinsteinToolkit/arrangements/EinsteinEvolve/GRHydro_InitData/src/GRHydro_PoloidalMagFieldM.F90:110:2: warning: #warning "This algorithm does only work on Cartesian grids!!" [-Wcpp]

	Creating Formaline tarball for thorn FFTW3

	Creating Formaline tarball for the configuration options

	Checking status of thorn CT_MultiLevel

	Checking status of thorn CarpetEvolutionMask

	Checking status of thorn CarpetIOASCII

	Checking status of thorn CarpetIOBasic

	Checking status of thorn CarpetIOHDF5

	Checking status of thorn CarpetIOScalar

	Checking status of thorn CarpetIntegrateTest

	Checking status of thorn CarpetInterp

	Checking status of thorn CarpetInterp2

	Checking status of thorn CarpetReduce

	Checking status of thorn CarpetRegrid

	COMPILING arrangements/Carpet/CarpetInterp2/src/fasterp.cc

	Checking status of thorn CarpetRegrid2

	Checking status of thorn CarpetSlab

	Checking status of thorn GRHydro

	Checking status of thorn NoExcision

	/home/jenkins/workspace/EinsteinToolkit/arrangements/Carpet/CarpetInterp2/src/fasterp.cc:317:0: warning: ignoring #pragma omp simd [-Wunknown-pragmas]

	/home/jenkins/workspace/EinsteinToolkit/arrangements/Carpet/CarpetInterp2/src/fasterp.cc:325:0: warning: ignoring #pragma omp simd [-Wunknown-pragmas]

	/home/jenkins/workspace/EinsteinToolkit/arrangements/Carpet/CarpetInterp2/src/fasterp.cc: In member function ‘void CarpetInterp2::fasterp_src_loc_t::interpolate(const ivect&, const ivect&, const std::vector<const double*>&, CCTK_REAL8*) const’:

	/home/jenkins/workspace/EinsteinToolkit/arrangements/Carpet/CarpetInterp2/src/fasterp.cc:313:72: error: requested alignment is not a constant

	make[3]: *** [fasterp.cc.o] Error 1

	make[2]: *** [make.checked] Error 2

	make[1]: *** [/home/jenkins/workspace/EinsteinToolkit/configs/sim/lib/libthorn_CarpetInterp2.a] Error 2

	make[1]: *** Waiting for unfinished jobs....

	make: *** [sim] Error 2

	Build step 'Execute shell' marked build as failure

	Archiving artifacts

	Recording test results

	ERROR: Step ‘Publish JUnit test result report’ failed: Test reports were found but none of them are new. Did tests run?

	For example, /home/jenkins/workspace/EinsteinToolkit/testresults.xml is 1 day 9 hr old

	

	IRC notifier plugin: Sending notification to: #cactus

	IRC notifier plugin: [ERROR] not connected. Cannot send message to '#cactus'

	[BFA] Scanning build for known causes...

	[BFA] No failure causes found

	[BFA] Done. 0s

	Started calculate disk usage of build

	Finished Calculation of disk usage of build in 0 seconds

	Started calculate disk usage of workspace

	Finished Calculation of disk usage of workspace in  2 second

	Email was triggered for: Failure - Any

	Sending email for trigger: Failure - Any