BUILD FAILURE

Build URL:https://build.barrywardell.net/job/EinsteinToolkit/1611/
Project:EinsteinToolkit
Date of build:Sat, 02 May 2020 20:00:40 +0000
Build duration:1 min 42 sec

Changes

Revision: 3c9a6d1dbd63c99af2154a1b9df33cc44e404c2a
Author:Einstein Toolkit Git Server
Log:
Updated submodules:

* flesh 3a60217...6be164b (1):
  > Cactus: handle vector grid fnctions in RDWR parsing
Revision: 162b437c556dcc2b8e949921038f0fbc38f23f1a
Author:Einstein Toolkit Git Server
Log:
Updated submodules:

* arrangements/CactusNumerical 2305695...dc65466 (2):
  > Dissipation: expand variables in rdwr clause
  > MoL: comment only changes

* arrangements/CactusWave 384e5bc...f2d5f60 (1):
  > IDScalarWaveC: expand variables in rdwr clause

* arrangements/EinsteinAnalysis 1501990...b5bf446 (1):
  > ADMAnalysis: expand variables in rdwr clause

* arrangements/EinsteinInitialData c133602...d8cd892 (7):
  > NoExcision: expand variables in rdwr clause
  > IDLinearWaves: expand variables in rdwr clause
  > IDAxiBrillBH: expand variables in rdwr clause
  > IDAnalyticBH: expand variables in rdwr clause
  > Exact: expand variables in rdwr clause
  > TwoPunctures: expand variables in rdwr clause
  > TOVSolver: expand variables in rdwr clauses

* repos/McLachlan 09db72a...041cfb5 (1):
  > ML_BSSN_Helper: expand variables in rdwr clause

* repos/carpet 3acfebf...e1cdf44 (9):
  > CarpetTracker: expand variables in rdwr clause
  > CarpetRegridTest: expand variables in rdwr clause
  > CarpetProlongateTest: expand variables in rdwr clause
  > CarpetMask: expand variables in rdwr clause
  > ReductionTest3: expand variables in rdwr clause
  > Carpet: check only reads in PreValid checks
  > Carpet: be more consistent using on() function to check flags
  > Carpet: do not use function name only to identify reads / writes
  > Carpet: remove unused PreSync functions
Revision: 253dada3341b05e5ac7278af03e5f1f6d9ee5833
Author:Einstein Toolkit Git Server
Log:
Updated submodules:

* arrangements/CactusExamples a32aac5...8a9d885 (1):
  > IDWaveMoL: expand variables in rdwr clause
Revision: e66fbdd0f0d7ef4ff96f3374d24421a66cccaa66
Author:Einstein Toolkit Git Server
Log:
Updated submodules:

* arrangements/CactusTest cc2523e...2eae5b9 (2):
  > TestReadWrite: enable psync_error in test
  > TestReadWrite: correct regions for var1

* arrangements/EinsteinBase 58e4ac9...3a122b7 (1):
  > TmunuBase: expand variables in rdwr clause

* utils dafd4f5...96621e6 (1):
  > MakeThornList: strip empty empty thorn names from activethorns
Revision: 3aae8323b5e6e547fd0a9478e55790c3921fb4bc
Author:Einstein Toolkit Git Server
Log:
Updated submodules:

* simfactory c217d88...4105751 (3):
  > supermucng: use only 2 build processes
  > supermucng: correct location for PAPI 5.7
  > bluewaters: disable CUDA


Console Output


	[...truncated 107.62 KB...]

	Checking status of thorn Nice

	Checking status of thorn Noise

	Checking status of thorn Norms

	Checking status of thorn NullDecomp

	Checking status of thorn NullGrid

	Checking status of thorn NullVars

	Checking status of thorn OpenSSL

	Checking status of thorn Outflow

	Checking status of thorn PAPI

	Checking status of thorn TATelliptic

	Checking status of thorn ProcaBase

	Checking status of thorn ProcaEvolve

	Checking status of thorn Proca_simpleID

	Checking status of thorn PunctureTracker

	Checking status of thorn ReductionTest

	Checking status of thorn ReductionTest2

	Checking status of thorn ReductionTest3

	Checking status of thorn ReflectionSymmetry

	Checking status of thorn RegridSyncTest

	Checking status of thorn RotatingDBHIVP

	Checking status of thorn SampleBoundary

	Checking status of thorn SampleIO

	Checking status of thorn Seed_Magnetic_Fields

	Checking status of thorn Seed_Magnetic_Fields_BNS

	Checking status of thorn SetMask_SphericalSurface

	Checking status of thorn SlabTest

	Checking status of thorn StaticConformal

	Checking status of thorn SymBase

	Checking status of thorn SystemStatistics

	Checking status of thorn TerminationTrigger

	Checking status of thorn TestArrays

	Checking status of thorn TestComplex

	Checking status of thorn TestCoordinates

	Checking status of thorn TestFortranCrayPointers

	Checking status of thorn TestFortranDependencies2

	Checking status of thorn TestFpointerNULL

	Checking status of thorn TestFreeF90

	Checking status of thorn TestGlobalReduce

	Checking status of thorn TestInclude1

	Checking status of thorn TestInclude2

	Checking status of thorn TestLocalInterp2

	Checking status of thorn TestLocalReduce

	Checking status of thorn TestLoop

	Checking status of thorn TestMath

	Checking status of thorn TestMoL

	Checking status of thorn TestPar

	Checking status of thorn TestReadWrite

	COMPILING configs/sim/bindings/build/TestReadWrite/cctk_ThornBindings.c

	Checking status of thorn TestReduce

	COMPILING CactusTest/TestReadWrite/src/TestC.cc

	COMPILING CactusTest/TestReadWrite/src/TestF.F90

	Checking status of thorn TestSchedule

	COMPILING CactusTest/TestSchedule/src/TestSchedule.c

	/home/jenkins/workspace/EinsteinToolkit/configs/sim/build/TestReadWrite/TestC.cc: In function 'void TestReadWrite_TestC_C(cGH*)':

	/home/jenkins/workspace/EinsteinToolkit/configs/sim/build/TestReadWrite/TestC.cc:69:96: error: expected ',' before ')' token

	static_assert(!std::is_const<std::remove_reference<decltype(*VarCurrentLevelC)>::type>::value);

	^

	/home/jenkins/workspace/EinsteinToolkit/configs/sim/build/TestReadWrite/TestC.cc:69:96: error: expected string-literal before ')' token

	/home/jenkins/workspace/EinsteinToolkit/configs/sim/build/TestReadWrite/TestC.cc:71:83: error: expected ',' before ')' token

	static_assert(std::is_const<std::remove_reference<decltype(*Var1)>::type>::value);

	^

	/home/jenkins/workspace/EinsteinToolkit/configs/sim/build/TestReadWrite/TestC.cc:71:83: error: expected string-literal before ')' token

	/home/jenkins/workspace/EinsteinToolkit/configs/sim/build/TestReadWrite/TestC.cc:72:85: error: expected ',' before ')' token

	static_assert(std::is_const<std::remove_reference<decltype(*Var1_p)>::type>::value);

	^

	/home/jenkins/workspace/EinsteinToolkit/configs/sim/build/TestReadWrite/TestC.cc:72:85: error: expected string-literal before ')' token

	/home/jenkins/workspace/EinsteinToolkit/configs/sim/build/TestReadWrite/TestC.cc:74:88: error: expected ',' before ')' token

	std::is_const<std::remove_reference<decltype(*groupVar2)>::type>::value);

	^

	/home/jenkins/workspace/EinsteinToolkit/configs/sim/build/TestReadWrite/TestC.cc:74:88: error: expected string-literal before ')' token

	/home/jenkins/workspace/EinsteinToolkit/configs/sim/build/TestReadWrite/TestC.cc:76:92: error: expected ',' before ')' token

	std::is_const<std::remove_reference<decltype(*groupVar2_p_p)>::type>::value);

	^

	/home/jenkins/workspace/EinsteinToolkit/configs/sim/build/TestReadWrite/TestC.cc:76:92: error: expected string-literal before ')' token

	/home/jenkins/workspace/EinsteinToolkit/configs/sim/config-data/make.config.rules:278: recipe for target 'TestC.cc.o' failed

	make[3]: *** [TestC.cc.o] Error 1

	/home/jenkins/workspace/EinsteinToolkit/lib/make/make.thornlib:112: recipe for target 'make.checked' failed

	make[2]: *** [make.checked] Error 2

	/home/jenkins/workspace/EinsteinToolkit/lib/make/make.configuration:179: recipe for target '/home/jenkins/workspace/EinsteinToolkit/configs/sim/lib/libthorn_TestReadWrite.a' failed

	make[1]: *** [/home/jenkins/workspace/EinsteinToolkit/configs/sim/lib/libthorn_TestReadWrite.a] Error 2

	make[1]: *** Waiting for unfinished jobs....

	COMPILING configs/sim/bindings/build/TestSchedule/cctk_ThornBindings.c

	Updating /home/jenkins/workspace/EinsteinToolkit/configs/sim/lib/libthorn_TestSchedule.a

	Makefile:259: recipe for target 'sim' failed

	make: *** [sim] Error 2

	Build step 'Execute shell' marked build as failure

	Archiving artifacts

	Recording test results

	ERROR: Step ?Publish JUnit test result report? failed: Test reports were found but none of them are new. Did leafNodes run?

	For example, /home/jenkins/workspace/EinsteinToolkit/testresults.xml is 2 days 2 hr old

	

	IRC notifier plugin: Sending notification to: #cactus

	IRC notifier plugin: [ERROR] not connected. Cannot send message to '#cactus'

	Started calculate disk usage of build

	Finished Calculation of disk usage of build in 0 seconds

	Started calculate disk usage of workspace

	Finished Calculation of disk usage of workspace in  1 second

	Email was triggered for: Failure - Any

	Sending email for trigger: Failure - Any