BUILD FAILURE

Build URL:https://build.barrywardell.net/job/EinsteinToolkit/689/
Project:EinsteinToolkit
Date of build:Thu, 21 Jan 2016 18:42:25 +0000
Build duration:1 hr 44 min

Changes

Revision: 3b52c6d62071e5d5d4382c9328590bbeb3ba4d87
Author:Einstein Toolkit Git Server
Log:
Updated submodules:

* arrangements/ExternalLibraries/MPI 8ac7b80...86f2058 (1):
  > Update enclosed OpenMPI to 1.10.1


Console Output


	[...truncated 11724 lines...]

	rho_z_[7][7].xg: differences below tolerance on 2 lines

	scon[0]_y_[7][7].xg: differences below tolerance on 1 lines

	tau_3D_diagonal.xg: differences below tolerance on 1 lines

	tau_x_[7][7].xg: differences below tolerance on 2 lines

	tau_y_[7][7].xg: differences below tolerance on 2 lines

	tau_z_[7][7].xg: differences below tolerance on 3 lines

	

	

	

	Success: 48 files compared, 17 differ in the last digits

	

	------------------------------------------------------------------------

	

	Test GRHydro: GRHydro_test_shock_weno

	"Diagonal shocktube, RK2, Roe, WENO5, Ideal Gas"

	

	Issuing rm -f output-0000-active && ln -s . output-0000-active && mkdir -p SIMFACTORY && TESTSUITE_PARFILE=/home/jenkins/workspace/simulations/EinsteinToolkit_3b52c6d62071e5d5d4382c9328590bbeb3ba4d87_2/output-0000/arrangements/EinsteinEvolve/GRHydro/test/GRHydro_test_shock_weno.par /home/jenkins/workspace/EinsteinToolkit/../simulations/EinsteinToolkit_3b52c6d62071e5d5d4382c9328590bbeb3ba4d87_2/output-0000/SIMFACTORY/RunScript

	

	rho_3D_diagonal.xg: differences below tolerance on 1 lines

	rho_y_[7][7].xg: differences below tolerance on 1 lines

	

	

	

	Success: 48 files compared, 2 differ in the last digits

	

	------------------------------------------------------------------------

	

	Test GRHydro: test_tov_carpet_refined_nosync

	"Carpet mesh refined, one TOV, synchronize only conservatives"

	

	Issuing rm -f output-0000-active && ln -s . output-0000-active && mkdir -p SIMFACTORY && TESTSUITE_PARFILE=/home/jenkins/workspace/simulations/EinsteinToolkit_3b52c6d62071e5d5d4382c9328590bbeb3ba4d87_2/output-0000/arrangements/EinsteinEvolve/GRHydro/test/test_tov_carpet_refined_nosync.par /home/jenkins/workspace/EinsteinToolkit/../simulations/EinsteinToolkit_3b52c6d62071e5d5d4382c9328590bbeb3ba4d87_2/output-0000/SIMFACTORY/RunScript

	

	rho.x.asc: differences below tolerance on 2 lines

	rho.y.asc: differences below tolerance on 2 lines

	rho.z.asc: differences below tolerance on 6 lines

	

	

	

	Success: 3 files compared, 3 differ in the last digits

	

	------------------------------------------------------------------------

	

	Test GRHydro: tov_carpetevolutionmask

	"Carpet mesh refined, one TOV, polytrope, test evolution mask"

	

	Issuing rm -f output-0000-active && ln -s . output-0000-active && mkdir -p SIMFACTORY && TESTSUITE_PARFILE=/home/jenkins/workspace/simulations/EinsteinToolkit_3b52c6d62071e5d5d4382c9328590bbeb3ba4d87_2/output-0000/arrangements/EinsteinEvolve/GRHydro/test/tov_carpetevolutionmask.par /home/jenkins/workspace/EinsteinToolkit/../simulations/EinsteinToolkit_3b52c6d62071e5d5d4382c9328590bbeb3ba4d87_2/output-0000/SIMFACTORY/RunScript

	

	Success: 6 files identical

	

	------------------------------------------------------------------------

	

	Test GRHydro: tov_carpetevolutionmask2

	"Carpet mesh refined, one TOV, Gamma-law, use evolution mask"

	

	Issuing rm -f output-0000-active && ln -s . output-0000-active && mkdir -p SIMFACTORY && TESTSUITE_PARFILE=/home/jenkins/workspace/simulations/EinsteinToolkit_3b52c6d62071e5d5d4382c9328590bbeb3ba4d87_2/output-0000/arrangements/EinsteinEvolve/GRHydro/test/tov_carpetevolutionmask2.par /home/jenkins/workspace/EinsteinToolkit/../simulations/EinsteinToolkit_3b52c6d62071e5d5d4382c9328590bbeb3ba4d87_2/output-0000/SIMFACTORY/RunScript

	Slave went offline during the build

	ERROR: Connection was broken: java.io.IOException: Unexpected EOF

	at hudson.remoting.ChunkedInputStream.readUntilBreak(ChunkedInputStream.java:99)

	at hudson.remoting.ChunkedCommandTransport.readBlock(ChunkedCommandTransport.java:39)

	at hudson.remoting.AbstractSynchronousByteArrayCommandTransport.read(AbstractSynchronousByteArrayCommandTransport.java:34)

	at hudson.remoting.SynchronousCommandTransport$ReaderThread.run(SynchronousCommandTransport.java:48)

	

	Build step 'Execute shell' marked build as failure

	ERROR: Publisher hudson.tasks.ArtifactArchiver aborted due to exception

	hudson.AbortException: no workspace for EinsteinToolkit #689

	at hudson.tasks.BuildStepCompatibilityLayer.perform(BuildStepCompatibilityLayer.java:72)

	at hudson.tasks.BuildStepMonitor$1.perform(BuildStepMonitor.java:20)

	at hudson.model.AbstractBuild$AbstractBuildExecution.perform(AbstractBuild.java:761)

	at hudson.model.AbstractBuild$AbstractBuildExecution.performAllBuildSteps(AbstractBuild.java:721)

	at hudson.model.Build$BuildExecution.post2(Build.java:183)

	at hudson.model.AbstractBuild$AbstractBuildExecution.post(AbstractBuild.java:670)

	at hudson.model.Run.execute(Run.java:1766)

	at hudson.model.FreeStyleBuild.run(FreeStyleBuild.java:43)

	at hudson.model.ResourceController.execute(ResourceController.java:98)

	at hudson.model.Executor.run(Executor.java:374)

	ERROR: Publisher hudson.tasks.junit.JUnitResultArchiver aborted due to exception

	hudson.AbortException: no workspace for EinsteinToolkit #689

	at hudson.tasks.BuildStepCompatibilityLayer.perform(BuildStepCompatibilityLayer.java:72)

	at hudson.tasks.BuildStepMonitor$1.perform(BuildStepMonitor.java:20)

	at hudson.model.AbstractBuild$AbstractBuildExecution.perform(AbstractBuild.java:761)

	at hudson.model.AbstractBuild$AbstractBuildExecution.performAllBuildSteps(AbstractBuild.java:721)

	at hudson.model.Build$BuildExecution.post2(Build.java:183)

	at hudson.model.AbstractBuild$AbstractBuildExecution.post(AbstractBuild.java:670)

	at hudson.model.Run.execute(Run.java:1766)

	at hudson.model.FreeStyleBuild.run(FreeStyleBuild.java:43)

	at hudson.model.ResourceController.execute(ResourceController.java:98)

	at hudson.model.Executor.run(Executor.java:374)

	IRC notifier plugin: Sending notification to: #cactus

	IRC notifier plugin: [ERROR] not connected. Cannot send message to '#cactus'

	[BFA] Scanning build for known causes...

	[BFA] No failure causes found

	[BFA] Done. 0s

	Started calculate disk usage of build

	Finished Calculation of disk usage of build in 0 seconds

	Email was triggered for: Failure - 1st

	Email was triggered for: Failure - Any

	Trigger Failure - Any was overridden by another trigger and will not send an email.

	Trigger Failure - Still was overridden by another trigger and will not send an email.

	Sending email for trigger: Failure - 1st