BUILD FAILURE
| Build URL: | https://build.barrywardell.net/job/EinsteinToolkit/518/ |
| Project: | EinsteinToolkit |
| Date of build: | Tue, 09 Jun 2015 14:13:10 +0000 |
| Build duration: | 42 min |
| Revision: | ba108e36ee3bac505826eb53bc376db7b73f8f5a |
| Author: | Einstein Toolkit Git Server |
| Log: | Updated submodules: * flesh 35a5524...898d23d (1): > Cactus: Merge branch 'check-for-PI-and-strdup' |
[...truncated 17505 lines...] phix.norm2.asc: differences below tolerance on 1 lines phiy.average.asc: differences below tolerance on 10 lines phiy.norm2.asc: differences below tolerance on 1 lines Success: 66 files compared, 7 differ in the last digits ------------------------------------------------------------------------ Test CarpetProlongateTest: test_cc_horest_o3 "Carpet/CarpetProlongateTest/test/test_cc_horest_o3.par" Issuing rm -f output-0000-active && ln -s . output-0000-active && mkdir -p SIMFACTORY && TESTSUITE_PARFILE=/home/jenkins/workspace/simulations/EinsteinToolkit_ba108e36ee3bac505826eb53bc376db7b73f8f5a_2/output-0000/arrangements/Carpet/CarpetProlongateTest/test/test_cc_horest_o3.par /home/jenkins/workspace/EinsteinToolkit/../simulations/EinsteinToolkit_ba108e36ee3bac505826eb53bc376db7b73f8f5a_2/output-0000/SIMFACTORY/RunScript Success: 9 files identical ------------------------------------------------------------------------ Test CarpetProlongateTest: test_cc_horest_o5 "Carpet/CarpetProlongateTest/test/test_cc_horest_o5.par" Issuing rm -f output-0000-active && ln -s . output-0000-active && mkdir -p SIMFACTORY && TESTSUITE_PARFILE=/home/jenkins/workspace/simulations/EinsteinToolkit_ba108e36ee3bac505826eb53bc376db7b73f8f5a_2/output-0000/arrangements/Carpet/CarpetProlongateTest/test/test_cc_horest_o5.par /home/jenkins/workspace/EinsteinToolkit/../simulations/EinsteinToolkit_ba108e36ee3bac505826eb53bc376db7b73f8f5a_2/output-0000/SIMFACTORY/RunScript Success: 9 files identical ------------------------------------------------------------------------ Test CarpetProlongateTest: test_cc_o0 "Carpet/CarpetProlongateTest/test/test_cc_o0.par" Issuing rm -f output-0000-active && ln -s . output-0000-active && mkdir -p SIMFACTORY && TESTSUITE_PARFILE=/home/jenkins/workspace/simulations/EinsteinToolkit_ba108e36ee3bac505826eb53bc376db7b73f8f5a_2/output-0000/arrangements/Carpet/CarpetProlongateTest/test/test_cc_o0.par /home/jenkins/workspace/EinsteinToolkit/../simulations/EinsteinToolkit_ba108e36ee3bac505826eb53bc376db7b73f8f5a_2/output-0000/SIMFACTORY/RunScript Success: 9 files identical ------------------------------------------------------------------------ Test CarpetProlongateTest: test_cc_o1 "Carpet/CarpetProlongateTest/test/test_cc_o1.par" Issuing rm -f output-0000-active && ln -s . output-0000-active && mkdir -p SIMFACTORY && TESTSUITE_PARFILE=/home/jenkins/workspace/simulations/EinsteinToolkit_ba108e36ee3bac505826eb53bc376db7b73f8f5a_2/output-0000/arrangements/Carpet/CarpetProlongateTest/test/test_cc_o1.par /home/jenkins/workspace/EinsteinToolkit/../simulations/EinsteinToolkit_ba108e36ee3bac505826eb53bc376db7b73f8f5a_2/output-0000/SIMFACTORY/RunScript Success: 9 files identical ------------------------------------------------------------------------ Test CarpetProlongateTest: test_cc_o2 "Carpet/CarpetProlongateTest/test/test_cc_o2.par" Issuing rm -f output-0000-active && ln -s . output-0000-active && mkdir -p SIMFACTORY && TESTSUITE_PARFILE=/home/jenkins/workspace/simulations/EinsteinToolkit_ba108e36ee3bac505826eb53bc376db7b73f8f5a_2/output-0000/arrangements/Carpet/CarpetProlongateTest/test/test_cc_o2.par /home/jenkins/workspace/EinsteinToolkit/../simulations/EinsteinToolkit_ba108e36ee3bac505826eb53bc376db7b73f8f5a_2/output-0000/SIMFACTORY/RunScript Slave went offline during the build ERROR: Connection was broken: java.io.IOException: Unexpected termination of the channel at hudson.remoting.SynchronousCommandTransport$ReaderThread.run(SynchronousCommandTransport.java:50) Caused by: java.io.EOFException at java.io.ObjectInputStream$PeekInputStream.readFully(ObjectInputStream.java:2325) at java.io.ObjectInputStream$BlockDataInputStream.readShort(ObjectInputStream.java:2794) at java.io.ObjectInputStream.readStreamHeader(ObjectInputStream.java:801) at java.io.ObjectInputStream.<init>(ObjectInputStream.java:299) at hudson.remoting.ObjectInputStreamEx.<init>(ObjectInputStreamEx.java:40) at hudson.remoting.AbstractSynchronousByteArrayCommandTransport.read(AbstractSynchronousByteArrayCommandTransport.java:34) at hudson.remoting.SynchronousCommandTransport$ReaderThread.run(SynchronousCommandTransport.java:48) Build step 'Execute shell' marked build as failure ERROR: Publisher hudson.tasks.ArtifactArchiver aborted due to exception hudson.AbortException: no workspace for EinsteinToolkit #518 at hudson.tasks.BuildStepCompatibilityLayer.perform(BuildStepCompatibilityLayer.java:72) at hudson.tasks.BuildStepMonitor$1.perform(BuildStepMonitor.java:20) at hudson.model.AbstractBuild$AbstractBuildExecution.perform(AbstractBuild.java:761) at hudson.model.AbstractBuild$AbstractBuildExecution.performAllBuildSteps(AbstractBuild.java:721) at hudson.model.Build$BuildExecution.post2(Build.java:183) at hudson.model.AbstractBuild$AbstractBuildExecution.post(AbstractBuild.java:670) at hudson.model.Run.execute(Run.java:1766) at hudson.model.FreeStyleBuild.run(FreeStyleBuild.java:43) at hudson.model.ResourceController.execute(ResourceController.java:98) at hudson.model.Executor.run(Executor.java:374) ERROR: Publisher hudson.tasks.junit.JUnitResultArchiver aborted due to exception hudson.AbortException: no workspace for EinsteinToolkit #518 at hudson.tasks.BuildStepCompatibilityLayer.perform(BuildStepCompatibilityLayer.java:72) at hudson.tasks.BuildStepMonitor$1.perform(BuildStepMonitor.java:20) at hudson.model.AbstractBuild$AbstractBuildExecution.perform(AbstractBuild.java:761) at hudson.model.AbstractBuild$AbstractBuildExecution.performAllBuildSteps(AbstractBuild.java:721) at hudson.model.Build$BuildExecution.post2(Build.java:183) at hudson.model.AbstractBuild$AbstractBuildExecution.post(AbstractBuild.java:670) at hudson.model.Run.execute(Run.java:1766) at hudson.model.FreeStyleBuild.run(FreeStyleBuild.java:43) at hudson.model.ResourceController.execute(ResourceController.java:98) at hudson.model.Executor.run(Executor.java:374) IRC notifier plugin: Sending notification to: #cactus IRC notifier plugin: [ERROR] not connected. Cannot send message to '#cactus' [BFA] Scanning build for known causes... [BFA] No failure causes found [BFA] Done. 0s Started calculate disk usage of build Finished Calculation of disk usage of build in 0 seconds Email was triggered for: Failure - 1st Email was triggered for: Failure - Any Trigger Failure - Any was overridden by another trigger and will not send an email. Trigger Failure - Still was overridden by another trigger and will not send an email. Sending email for trigger: Failure - 1st