BUILD FAILURE
Changes
| Revision: |
7adb8642296220744bf013191af38f8cf6cc8738 |
| Author: | Einstein Toolkit Git Server |
| Log: | Updated submodules:
* flesh 6f50dc1...9277b85 (1):
> Rename PreSync.h -> cctk_PreSync.h
|
Console Output
[...truncated 127.57 KB...]
Warning: 'nkk' may be used uninitialized in this function [-Wmaybe-uninitialized]
/home/jenkins/workspace/EinsteinToolkit/configs/sim/build/SummationByParts/Dissipation_6_5_min_err_coeff_alt.f90:281:0:
INTEGER*4 :: nii, njj, nkk
^
note: 'nkk' was declared here
/home/jenkins/workspace/EinsteinToolkit/configs/sim/build/SummationByParts/Dissipation_6_5_min_err_coeff_alt.f90:562:0:
a(njj,njj-6) * var(:,or,:) ) * idel
^
Warning: 'njj' may be used uninitialized in this function [-Wmaybe-uninitialized]
/home/jenkins/workspace/EinsteinToolkit/configs/sim/build/SummationByParts/Dissipation_6_5_min_err_coeff_alt.f90:280:0:
INTEGER*4 :: il, ir, jl, jr, kl, kr, ol, or
^
Warning: 'ol' may be used uninitialized in this function [-Wmaybe-uninitialized]
/home/jenkins/workspace/EinsteinToolkit/configs/sim/build/SummationByParts/Dissipation_6_5_min_err_coeff_alt.f90:377:0:
a(nii,nii-6) * var(or,:,:) ) * idel
^
Warning: 'nii' may be used uninitialized in this function [-Wmaybe-uninitialized]
Updating /home/jenkins/workspace/EinsteinToolkit/configs/sim/lib/libthorn_SummationByParts.a
COMPILING Numerical/AEILocalInterp/src/Lagrange-maximum-degree/1d.cube.order1.smooth0.c
COMPILING Numerical/AEILocalInterp/src/Lagrange-maximum-degree/1d.cube.order2.smooth0.c
COMPILING Numerical/AEILocalInterp/src/Lagrange-maximum-degree/1d.cube.order3.smooth0.c
COMPILING Numerical/AEILocalInterp/src/Lagrange-maximum-degree/1d.cube.order4.smooth0.c
COMPILING Numerical/AEILocalInterp/src/Lagrange-maximum-degree/1d.cube.order5.smooth0.c
COMPILING Numerical/AEILocalInterp/src/Lagrange-maximum-degree/1d.cube.order6.smooth0.c
COMPILING Numerical/AEILocalInterp/src/Lagrange-maximum-degree/2d.cube.order1.smooth0.c
COMPILING Numerical/AEILocalInterp/src/Hermite/1d.cube.order2.c
COMPILING Numerical/AEILocalInterp/src/Lagrange-maximum-degree/2d.cube.order2.smooth0.c
COMPILING Numerical/AEILocalInterp/src/Hermite/1d.cube.order3.c
COMPILING Numerical/AEILocalInterp/src/Lagrange-maximum-degree/2d.cube.order3.smooth0.c
COMPILING Numerical/AEILocalInterp/src/Hermite/1d.cube.order4.c
COMPILING Numerical/AEILocalInterp/src/Hermite/2d.cube.order2.c
COMPILING Numerical/AEILocalInterp/src/Lagrange-maximum-degree/2d.cube.order4.smooth0.c
COMPILING Numerical/AEILocalInterp/src/Hermite/2d.cube.order3.c
COMPILING Numerical/AEILocalInterp/src/Lagrange-maximum-degree/3d.cube.order1.smooth0.c
COMPILING Numerical/AEILocalInterp/src/Lagrange-maximum-degree/3d.cube.order2.smooth0.c
COMPILING Numerical/AEILocalInterp/src/Hermite/3d.cube.order2.c
COMPILING Numerical/AEILocalInterp/src/Lagrange-maximum-degree/3d.cube.order3.smooth0.c
COMPILING Numerical/AEILocalInterp/src/Lagrange-maximum-degree/3d.cube.order4.smooth0.c
COMPILING Numerical/AEILocalInterp/src/Hermite/3d.cube.order3.c
Checking status of thorn zlib
Updating /home/jenkins/workspace/EinsteinToolkit/configs/sim/lib/libthorn_zlib.a
Checking status of thorn BLAS
COMPILING ExternalLibraries/BLAS/src/blas.F90
Updating /home/jenkins/workspace/EinsteinToolkit/configs/sim/lib/libthorn_BLAS.a
Checking status of thorn Baikal
In file included from /home/jenkins/workspace/EinsteinToolkit/configs/sim/bindings/include/Symmetry.h:4:0,
from /home/jenkins/workspace/EinsteinToolkit/arrangements/WVUThorns/Baikal/src/BoundaryConditions.c:7:
/home/jenkins/workspace/EinsteinToolkit/arrangements/CactusBase/CartGrid3D/src/Symmetry.h:25:21: fatal error: PreSync.h: No such file or directory
compilation terminated.
In file included from /home/jenkins/workspace/EinsteinToolkit/configs/sim/bindings/include/Symmetry.h:4:0,
from /home/jenkins/workspace/EinsteinToolkit/arrangements/WVUThorns/Baikal/src/MoL_registration.c:13:
/home/jenkins/workspace/EinsteinToolkit/arrangements/CactusBase/CartGrid3D/src/Symmetry.h:25:21: fatal error: PreSync.h: No such file or directory
compilation terminated.
In file included from /home/jenkins/workspace/EinsteinToolkit/configs/sim/bindings/include/Symmetry.h:4:0,
from /home/jenkins/workspace/EinsteinToolkit/arrangements/WVUThorns/Baikal/src/zero_rhss.c:5:
/home/jenkins/workspace/EinsteinToolkit/arrangements/CactusBase/CartGrid3D/src/Symmetry.h:25:21: fatal error: PreSync.h: No such file or directory
compilation terminated.
In file included from /home/jenkins/workspace/EinsteinToolkit/configs/sim/bindings/include/Symmetry.h:4:0,
from /home/jenkins/workspace/EinsteinToolkit/arrangements/WVUThorns/Baikal/src/Symmetry_registration_oldCartGrid3D.c:5:
/home/jenkins/workspace/EinsteinToolkit/arrangements/CactusBase/CartGrid3D/src/Symmetry.h:25:21: fatal error: PreSync.h: No such file or directory
compilation terminated.
COMPILING WVUThorns/Baikal/src/Banner.c
COMPILING WVUThorns/Baikal/src/RegisterSlicing.c
COMPILING WVUThorns/Baikal/src/Symmetry_registration_oldCartGrid3D.c
In file included from /home/jenkins/workspace/EinsteinToolkit/configs/sim/bindings/include/Symmetry.h:4:0,
from /home/jenkins/workspace/EinsteinToolkit/configs/sim/build/Baikal/Symmetry_registration_oldCartGrid3D.c:5:
/home/jenkins/workspace/EinsteinToolkit/arrangements/CactusBase/CartGrid3D/src/Symmetry.h:25:21: fatal error: PreSync.h: No such file or directory
compilation terminated.
/home/jenkins/workspace/EinsteinToolkit/configs/sim/config-data/make.config.rules:264: recipe for target 'Symmetry_registration_oldCartGrid3D.c.o' failed
make[3]: *** [Symmetry_registration_oldCartGrid3D.c.o] Error 1
/home/jenkins/workspace/EinsteinToolkit/lib/make/make.thornlib:112: recipe for target 'make.checked' failed
make[2]: *** [make.checked] Error 2
/home/jenkins/workspace/EinsteinToolkit/lib/make/make.configuration:179: recipe for target '/home/jenkins/workspace/EinsteinToolkit/configs/sim/lib/libthorn_Baikal.a' failed
make[1]: *** [/home/jenkins/workspace/EinsteinToolkit/configs/sim/lib/libthorn_Baikal.a] Error 2
make[1]: *** Waiting for unfinished jobs....
Updating /home/jenkins/workspace/EinsteinToolkit/configs/sim/lib/libthorn_AEILocalInterp.a
Makefile:259: recipe for target 'sim' failed
make: *** [sim] Error 2
Build step 'Execute shell' marked build as failure
Archiving artifacts
Recording test results
ERROR: Step ?Publish JUnit test result report? failed: Test reports were found but none of them are new. Did leafNodes run?
For example, /home/jenkins/workspace/EinsteinToolkit/testresults.xml is 1 hr 0 min old
IRC notifier plugin: Sending notification to: #cactus
IRC notifier plugin: [ERROR] not connected. Cannot send message to '#cactus'
Started calculate disk usage of build
Finished Calculation of disk usage of build in 0 seconds
Started calculate disk usage of workspace
Finished Calculation of disk usage of workspace in 2 second
Email was triggered for: Failure - 1st
Email was triggered for: Failure - Any
Trigger Failure - Any was overridden by another trigger and will not send an email.
Trigger Failure - Still was overridden by another trigger and will not send an email.
Sending email for trigger: Failure - 1st