BUILD FAILURE
| Build URL: | https://build.barrywardell.net/job/EinsteinToolkit/769/ |
| Project: | EinsteinToolkit |
| Date of build: | Mon, 16 May 2016 20:30:10 +0000 |
| Build duration: | 1 min 1 sec |
| Revision: | b751d4e52e66c97ed363fa8f40cb80225d75f1c3 |
| Author: | Einstein Toolkit Git Server |
| Log: | Updated submodules: * flesh a45e2a1...56dcb5b (1): > Flesh: remove the 'make checkout' option, along with the script that once supported that and documentation pointing towards it |
[...truncated 2456 lines...] Checking status of thorn WaveMoL Checking status of thorn WaveToyC Checking status of thorn WaveToyCXX Checking status of thorn WaveToyF77 Checking status of thorn WaveToyF90 Checking status of thorn WaveToyFreeF90 Checking status of thorn WeylScal4 Checking status of thorn ADMAnalysis Checking status of thorn ADMBase Checking status of thorn AHFinder Checking status of thorn MPI Checking status of thorn CT_Analytic Checking status of thorn CarpetLib Checking status of thorn EOS_Hybrid Checking status of thorn PETSc Checking status of thorn PUGH Checking status of thorn Formaline Checking status of thorn HTTPD Checking status of thorn MemSpeed Checking status of thorn NoMPI Checking status of thorn NullEvolve Checking status of thorn NullNews Checking status of thorn PUGHInterp Checking status of thorn PUGHReduce Checking status of thorn PUGHSlab Checking status of thorn Slab Checking status of thorn QuasiLocalMeasures Checking status of thorn SystemTopology Checking status of thorn TimerReport Checking status of thorn Cactus /home/jenkins/workspace/EinsteinToolkit/arrangements/EinsteinAnalysis/QuasiLocalMeasures/src/qlm_import_surface.F90:96:2: warning: #warning "TODO: Ensure that the surface parameters don't change" [-Wcpp] Checking status of thorn HDF5 Checking status of thorn Timers Checking status of thorn EOS_Omni Checking status of thorn EllPETSc Checking status of thorn HTTPDExtra Checking status of thorn IOHDF5Util Checking status of thorn IllinoisGRMHD Checking status of thorn Multipole Checking status of thorn NullConstr Checking status of thorn NullExact Checking status of thorn NullPsiInt Checking status of thorn NullSHRExtract Checking status of thorn Periodic Checking status of thorn RotatingSymmetry180 Checking status of thorn RotatingSymmetry90 Checking status of thorn SphericalHarmonicDecomp Checking status of thorn SphericalHarmonicRecon Checking status of thorn SphericalHarmonicReconGen Checking status of thorn AHFinderDirect Checking status of thorn Carpet Checking status of thorn GRHydro_InitData /home/jenkins/workspace/EinsteinToolkit/arrangements/EinsteinEvolve/GRHydro_InitData/src/GRHydro_PoloidalMagFieldM.F90:110:2: warning: #warning "This algorithm does only work on Cartesian grids!!" [-Wcpp] Checking status of thorn IOHDF5 Creating Formaline tarball for thorn FFTW3 Checking status of thorn CT_MultiLevel Checking status of thorn CarpetEvolutionMask Checking status of thorn CarpetIOASCII Checking status of thorn CarpetIOBasic Checking status of thorn CarpetIOHDF5 Checking status of thorn CarpetIOScalar Checking status of thorn CarpetIntegrateTest Checking status of thorn CarpetInterp Checking status of thorn CarpetInterp2 Checking status of thorn CarpetReduce Checking status of thorn CarpetRegrid Checking status of thorn CarpetRegrid2 Checking status of thorn CarpetSlab Checking status of thorn GRHydro Checking status of thorn NoExcision Checking status of thorn PeriodicCarpet Checking status of thorn Poisson Checking status of thorn TestCarpetGridInfo Creating Formaline tarball for the configuration options Formaline: Updating files in git repository... ERROR: Refusing to add "/home/jenkins/workspace/EinsteinToolkit/lib/sbin/checkout.pl" as it is not a regular file at /home/jenkins/workspace/EinsteinToolkit/configs/sim/scratch/Formaline/bin/update-git-repo.pl line 199, <STDIN> line 4874. make[1]: *** [git-store-source] Error 2 make[1]: *** Waiting for unfinished jobs.... make: *** [sim] Error 2 Build step 'Execute shell' marked build as failure Archiving artifacts Recording test results ERROR: Step ‘Publish JUnit test result report’ failed: Test reports were found but none of them are new. Did tests run? For example, /home/jenkins/workspace/EinsteinToolkit/testresults.xml is 2 hr 55 min old IRC notifier plugin: Sending notification to: #cactus IRC notifier plugin: [ERROR] not connected. Cannot send message to '#cactus' [BFA] Scanning build for known causes... [BFA] No failure causes found [BFA] Done. 0s Started calculate disk usage of build Finished Calculation of disk usage of build in 0 seconds Started calculate disk usage of workspace Finished Calculation of disk usage of workspace in 5 second Email was triggered for: Failure - 1st Email was triggered for: Failure - Any Trigger Failure - Any was overridden by another trigger and will not send an email. Trigger Failure - Still was overridden by another trigger and will not send an email. Sending email for trigger: Failure - 1st