BUILD FAILURE

Build URL:https://build.barrywardell.net/job/EinsteinToolkit/1144/
Project:EinsteinToolkit
Date of build:Wed, 19 Mar 2014 08:42:53 +0000
Build duration:1 min 13 sec

Changes

Revision: 90b1fa30e1afb63de21758c6c1fde6a51fe3b82c
Author:Einstein Toolkit Git Server
Log:
Updated submodules:

* repos/Kranc 1fbc896...952652c (1):
  > Merge work on vectorisation and expression processing into master

* repos/McLachlan 0c0695b...6788a20 (4):
  > Regenerate all thorns (Kranc commit 952652c8906deac83779c19028033d4cae839628)
  > Regenerate McLachlan (Kranc commit 5ed296abc1f729d6d4c5c4cc4a54b844c4804174)
  > Regenerate ML_BSSN (Kranc commit 353ecb0e815e5f0bcc92774450faf776c7433174)
  > Regenerate McLachlan (Kranc commit 49cd5ebb012c13eb9f41d122940f941e3e7c9e0c)


Console Output


	[...truncated 2196 lines...]

	/home/jenkins/workspace/EinsteinToolkit/configs/sim/bindings/include/ML_ADMQuantities/cctk_ScheduleFunctions.h:21:6: error: previous declaration of ‘void ML_ADMQuantities(cGH*)’

	/home/jenkins/workspace/EinsteinToolkit/arrangements/McLachlan/ML_ADMQuantities/src/ML_ADMQuantities.cc:18:28: error: ‘namespace ML_ADMQuantities { }’ redeclared as different kind of symbol

	/home/jenkins/workspace/EinsteinToolkit/configs/sim/bindings/include/ML_ADMQuantities/cctk_ScheduleFunctions.h:21:6: error: previous declaration of ‘void ML_ADMQuantities(cGH*)’

	/home/jenkins/workspace/EinsteinToolkit/arrangements/McLachlan/ML_ADMQuantities/src/ML_ADMQuantities.cc: In function ‘void ML_ADMQuantities::ML_ADMQuantities_SelectBCs(cGH*)’:

	/home/jenkins/workspace/EinsteinToolkit/arrangements/McLachlan/ML_ADMQuantities/src/ML_ADMQuantities.cc:28:83: error: ‘GetBoundaryWidth’ was not declared in this scope

	/home/jenkins/workspace/EinsteinToolkit/arrangements/McLachlan/ML_ADMQuantities/src/ML_ADMQuantities.cc: In function ‘void ML_ADMQuantities::ML_ADMQuantities_Body(const cGH*, int, int, const CCTK_REAL8*, const CCTK_REAL8*, const CCTK_REAL8*, const int*, const int*, int, CCTK_REAL8* const __restrict__*)’:

	/home/jenkins/workspace/EinsteinToolkit/arrangements/McLachlan/ML_ADMQuantities/src/ML_ADMQuantities.cc:103:65: error: ‘GroupDataPointers’ was not declared in this scope

	/home/jenkins/workspace/EinsteinToolkit/arrangements/McLachlan/ML_ADMQuantities/src/ML_ADMQuantities.cc:117:77: error: ‘GroupDataPointers’ was not declared in this scope

	/home/jenkins/workspace/EinsteinToolkit/arrangements/McLachlan/ML_ADMQuantities/src/ML_ADMQuantities.cc:123:73: error: ‘GroupDataPointers’ was not declared in this scope

	/home/jenkins/workspace/EinsteinToolkit/arrangements/McLachlan/ML_ADMQuantities/src/ML_ADMQuantities.cc:137:67: error: ‘GroupDataPointers’ was not declared in this scope

	/home/jenkins/workspace/EinsteinToolkit/arrangements/McLachlan/ML_ADMQuantities/src/ML_ADMQuantities.cc: In function ‘void ML_ADMQuantities::ML_ADMQuantities(cGH*)’:

	/home/jenkins/workspace/EinsteinToolkit/arrangements/McLachlan/ML_ADMQuantities/src/ML_ADMQuantities.cc:1628:60: error: ‘AssertGroupStorage’ was not declared in this scope

	/home/jenkins/workspace/EinsteinToolkit/arrangements/McLachlan/ML_ADMQuantities/src/ML_ADMQuantities.cc:1630:56: error: ‘EnsureStencilFits’ was not declared in this scope

	/home/jenkins/workspace/EinsteinToolkit/arrangements/McLachlan/ML_ADMQuantities/src/ML_ADMQuantities.cc:1632:49: error: ‘LoopOverInterior’ was not declared in this scope

	In file included from /home/jenkins/workspace/EinsteinToolkit/arrangements/McLachlan/ML_ADMQuantities/src/Kranc.cc:33:0:

	/home/jenkins/workspace/EinsteinToolkit/arrangements/McLachlan/ML_ADMQuantities/src/Kranc.hh:10:28: error: ‘namespace ML_ADMQuantities { }’ redeclared as different kind of symbol

	/home/jenkins/workspace/EinsteinToolkit/configs/sim/bindings/include/ML_ADMQuantities/cctk_ScheduleFunctions.h:21:6: error: previous declaration of ‘void ML_ADMQuantities(cGH*)’

	/home/jenkins/workspace/EinsteinToolkit/arrangements/McLachlan/ML_ADMQuantities/src/Kranc.cc:35:28: error: ‘namespace ML_ADMQuantities { }’ redeclared as different kind of symbol

	/home/jenkins/workspace/EinsteinToolkit/configs/sim/bindings/include/ML_ADMQuantities/cctk_ScheduleFunctions.h:21:6: error: previous declaration of ‘void ML_ADMQuantities(cGH*)’

	/home/jenkins/workspace/EinsteinToolkit/arrangements/McLachlan/ML_ADMQuantities/src/Kranc.cc:224:60: error: ‘Kranc_Calculation’ has not been declared

	/home/jenkins/workspace/EinsteinToolkit/arrangements/McLachlan/ML_ADMQuantities/src/Kranc.cc: In function ‘void ML_ADMQuantities::LoopOverEverything(const cGH*, int)’:

	/home/jenkins/workspace/EinsteinToolkit/arrangements/McLachlan/ML_ADMQuantities/src/Kranc.cc:236:74: error: ‘calc’ cannot be used as a function

	/home/jenkins/workspace/EinsteinToolkit/arrangements/McLachlan/ML_ADMQuantities/src/Kranc.cc: At global scope:

	/home/jenkins/workspace/EinsteinToolkit/arrangements/McLachlan/ML_ADMQuantities/src/Kranc.cc:244:58: error: ‘Kranc_Calculation’ has not been declared

	/home/jenkins/workspace/EinsteinToolkit/arrangements/McLachlan/ML_ADMQuantities/src/Kranc.cc: In function ‘void ML_ADMQuantities::LoopOverBoundary(const cGH*, int)’:

	/home/jenkins/workspace/EinsteinToolkit/arrangements/McLachlan/ML_ADMQuantities/src/Kranc.cc:326:90: error: ‘calc’ cannot be used as a function

	/home/jenkins/workspace/EinsteinToolkit/arrangements/McLachlan/ML_ADMQuantities/src/Kranc.cc: At global scope:

	/home/jenkins/workspace/EinsteinToolkit/arrangements/McLachlan/ML_ADMQuantities/src/Kranc.cc:340:68: error: ‘Kranc_Calculation’ has not been declared

	/home/jenkins/workspace/EinsteinToolkit/arrangements/McLachlan/ML_ADMQuantities/src/Kranc.cc: In function ‘void ML_ADMQuantities::LoopOverBoundaryWithGhosts(const cGH*, int)’:

	/home/jenkins/workspace/EinsteinToolkit/arrangements/McLachlan/ML_ADMQuantities/src/Kranc.cc:422:90: error: ‘calc’ cannot be used as a function

	/home/jenkins/workspace/EinsteinToolkit/arrangements/McLachlan/ML_ADMQuantities/src/Kranc.cc: At global scope:

	/home/jenkins/workspace/EinsteinToolkit/arrangements/McLachlan/ML_ADMQuantities/src/Kranc.cc:436:58: error: ‘Kranc_Calculation’ has not been declared

	/home/jenkins/workspace/EinsteinToolkit/arrangements/McLachlan/ML_ADMQuantities/src/Kranc.cc: In function ‘void ML_ADMQuantities::LoopOverInterior(const cGH*, int)’:

	/home/jenkins/workspace/EinsteinToolkit/arrangements/McLachlan/ML_ADMQuantities/src/Kranc.cc:453:74: error: ‘calc’ cannot be used as a function

	/home/jenkins/workspace/EinsteinToolkit/arrangements/McLachlan/ML_ADMQuantities/src/Kranc.cc: At global scope:

	/home/jenkins/workspace/EinsteinToolkit/arrangements/McLachlan/ML_ADMQuantities/src/Kranc.cc:604:9: error: ‘KrancData’ does not name a type

	/home/jenkins/workspace/EinsteinToolkit/arrangements/McLachlan/ML_ADMQuantities/src/Kranc.cc:604:30: error: ISO C++ forbids declaration of ‘kd_coarse’ with no type [-fpermissive]

	/home/jenkins/workspace/EinsteinToolkit/arrangements/McLachlan/ML_ADMQuantities/src/Kranc.cc:606:21: error: ‘KrancData’ does not name a type

	/home/jenkins/workspace/EinsteinToolkit/arrangements/McLachlan/ML_ADMQuantities/src/Kranc.cc:606:42: error: ISO C++ forbids declaration of ‘kd’ with no type [-fpermissive]

	/home/jenkins/workspace/EinsteinToolkit/arrangements/McLachlan/ML_ADMQuantities/src/Kranc.cc: In function ‘void ML_ADMQuantities::TiledLoop(const cGH*, const int&, void (*)(const cGH*, const int&))’:

	/home/jenkins/workspace/EinsteinToolkit/arrangements/McLachlan/ML_ADMQuantities/src/Kranc.cc:631:33: error: request for member ‘imin’ in ‘kd_coarse’, which is of non-class type ‘const int’

	/home/jenkins/workspace/EinsteinToolkit/arrangements/McLachlan/ML_ADMQuantities/src/Kranc.cc:632:33: error: request for member ‘imax’ in ‘kd_coarse’, which is of non-class type ‘const int’

	/home/jenkins/workspace/EinsteinToolkit/arrangements/McLachlan/ML_ADMQuantities/src/Kranc.cc:643:36: error: request for member ‘imin’ in ‘kd_coarse’, which is of non-class type ‘const int’

	/home/jenkins/workspace/EinsteinToolkit/arrangements/McLachlan/ML_ADMQuantities/src/Kranc.cc:644:33: error: request for member ‘imax’ in ‘kd_coarse’, which is of non-class type ‘const int’

	/home/jenkins/workspace/EinsteinToolkit/arrangements/McLachlan/ML_ADMQuantities/src/Kranc.cc:658:9: error: ‘KrancData’ was not declared in this scope

	/home/jenkins/workspace/EinsteinToolkit/arrangements/McLachlan/ML_ADMQuantities/src/Kranc.cc:658:19: error: expected ‘;’ before ‘kd’

	/home/jenkins/workspace/EinsteinToolkit/arrangements/McLachlan/ML_ADMQuantities/src/Kranc.cc:660:9: error: ‘kd’ was not declared in this scope

	/home/jenkins/workspace/EinsteinToolkit/arrangements/McLachlan/ML_ADMQuantities/src/Kranc.cc: At global scope:

	/home/jenkins/workspace/EinsteinToolkit/arrangements/McLachlan/ML_ADMQuantities/src/Kranc.cc:684:21: error: ‘KrancData’ does not name a type

	/home/jenkins/workspace/EinsteinToolkit/arrangements/McLachlan/ML_ADMQuantities/src/Kranc.cc:684:42: error: ISO C++ forbids declaration of ‘kd’ with no type [-fpermissive]

	/home/jenkins/workspace/EinsteinToolkit/arrangements/McLachlan/ML_ADMQuantities/src/Kranc.cc: In function ‘void ML_ADMQuantities::TiledLoopOverEverything(const cGH*, void (*)(const cGH*, const int&))’:

	/home/jenkins/workspace/EinsteinToolkit/arrangements/McLachlan/ML_ADMQuantities/src/Kranc.cc:689:3: error: ‘KrancData’ was not declared in this scope

	/home/jenkins/workspace/EinsteinToolkit/arrangements/McLachlan/ML_ADMQuantities/src/Kranc.cc:689:13: error: expected ‘;’ before ‘kd_coarse’

	/home/jenkins/workspace/EinsteinToolkit/arrangements/McLachlan/ML_ADMQuantities/src/Kranc.cc:693:5: error: ‘kd_coarse’ was not declared in this scope

	/home/jenkins/workspace/EinsteinToolkit/arrangements/McLachlan/ML_ADMQuantities/src/Kranc.cc:697:21: error: ‘kd_coarse’ was not declared in this scope

	/home/jenkins/workspace/EinsteinToolkit/arrangements/McLachlan/ML_ADMQuantities/src/Kranc.cc: At global scope:

	/home/jenkins/workspace/EinsteinToolkit/arrangements/McLachlan/ML_ADMQuantities/src/Kranc.cc:707:21: error: ‘KrancData’ does not name a type

	/home/jenkins/workspace/EinsteinToolkit/arrangements/McLachlan/ML_ADMQuantities/src/Kranc.cc:707:42: error: ISO C++ forbids declaration of ‘kd’ with no type [-fpermissive]

	/home/jenkins/workspace/EinsteinToolkit/arrangements/McLachlan/ML_ADMQuantities/src/Kranc.cc: In function ‘void ML_ADMQuantities::TiledLoopOverInterior(const cGH*, void (*)(const cGH*, const int&))’:

	/home/jenkins/workspace/EinsteinToolkit/arrangements/McLachlan/ML_ADMQuantities/src/Kranc.cc:721:3: error: ‘KrancData’ was not declared in this scope

	/home/jenkins/workspace/EinsteinToolkit/arrangements/McLachlan/ML_ADMQuantities/src/Kranc.cc:721:13: error: expected ‘;’ before ‘kd_coarse’

	/home/jenkins/workspace/EinsteinToolkit/arrangements/McLachlan/ML_ADMQuantities/src/Kranc.cc:725:5: error: ‘kd_coarse’ was not declared in this scope

	/home/jenkins/workspace/EinsteinToolkit/arrangements/McLachlan/ML_ADMQuantities/src/Kranc.cc:729:21: error: ‘kd_coarse’ was not declared in this scope

	make[3]: *** [Kranc.cc.o] Error 1

	make[3]: *** Waiting for unfinished jobs....

	make[3]: *** [ML_ADMQuantities.cc.o] Error 1

	make[2]: *** [make.checked] Error 2

	make[1]: *** [/home/jenkins/workspace/EinsteinToolkit/configs/sim/lib/libthorn_ML_ADMQuantities.a] Error 2

	COMPILING arrangements/McLachlan/ML_BSSN/src/Kranc.cc

	COMPILING arrangements/McLachlan/ML_BSSN/src/Boundaries.cc

	COMPILING arrangements/McLachlan/ML_BSSN/src/ML_BSSN_Advect.cc

	COMPILING arrangements/McLachlan/ML_BSSN/src/ML_BSSN_boundary.cc

	COMPILING arrangements/McLachlan/ML_BSSN/src/ML_BSSN_constraints1.cc

	COMPILING arrangements/McLachlan/ML_BSSN/src/ML_BSSN_constraints2.cc

	COMPILING arrangements/McLachlan/ML_BSSN/src/ML_BSSN_convertFromADMBase.cc

	COMPILING arrangements/McLachlan/ML_BSSN/src/ML_BSSN_convertFromADMBaseGamma.cc

	COMPILING arrangements/McLachlan/ML_BSSN/src/ML_BSSN_convertToADMBase.cc

	COMPILING arrangements/McLachlan/ML_BSSN/src/ML_BSSN_convertToADMBaseDtLapseShiftBoundary.cc

	COMPILING arrangements/McLachlan/ML_BSSN/src/ML_BSSN_convertToADMBaseDtLapseShift.cc

	COMPILING arrangements/McLachlan/ML_BSSN/src/ML_BSSN_convertToADMBaseFakeDtLapseShift.cc

	COMPILING arrangements/McLachlan/ML_BSSN/src/ML_BSSN_Dissipation.cc

	COMPILING arrangements/McLachlan/ML_BSSN/src/ML_BSSN_enforce.cc

	COMPILING arrangements/McLachlan/ML_BSSN/src/ML_BSSN_InitGamma.cc

	COMPILING arrangements/McLachlan/ML_BSSN/src/ML_BSSN_InitRHS.cc

	COMPILING arrangements/McLachlan/ML_BSSN/src/ML_BSSN_Minkowski.cc

	COMPILING arrangements/McLachlan/ML_BSSN/src/ML_BSSN_RHS1.cc

	COMPILING arrangements/McLachlan/ML_BSSN/src/ML_BSSN_RHS2.cc

	COMPILING arrangements/McLachlan/ML_BSSN/src/ML_BSSN_RHSStaticBoundary.cc

	COMPILING arrangements/McLachlan/ML_BSSN/src/RegisterMoL.cc

	COMPILING arrangements/McLachlan/ML_BSSN/src/RegisterSymmetries.cc

	COMPILING arrangements/McLachlan/ML_BSSN/src/Startup.cc

	Updating /home/jenkins/workspace/EinsteinToolkit/configs/sim/lib/libthorn_ML_BSSN.a

	make: *** [sim] Error 2

	Build step 'Execute shell' marked build as failure

	Archiving artifacts

	Recording test results

	IRC notifier plugin: Sending notification to: #cactus

	Email was triggered for: Failure

	Sending email for trigger: Failure