BUILD FAILURE
Changes
| Revision: |
0047c3dc0cb88bffe6efea57979b50b7012a4d6c |
| Author: | Einstein Toolkit Git Server |
| Log: | Updated submodules:
* flesh c282103...f17762a (1):
> Cactus: correct declaration of rdwr past timelevels of groups
|
Console Output
[...truncated 942.69 KB...]
COMPILING EinsteinEvolve/GRHydro/src/GRHydro_Eigenproblem_Marquina.F90
/home/jenkins/workspace/EinsteinToolkit/configs/sim/build/GRHydro/GRHydro_Eigenproblem_Marquina.f90:3:22:
gyy,gyz,gzz,u,det,alp,beta,densl,sxl,syl,szl,taul,&
1
Warning: Unused dummy argument 'det' at (1) [-Wunused-dummy-argument]
/home/jenkins/workspace/EinsteinToolkit/configs/sim/build/GRHydro/GRHydro_Eigenproblem_Marquina.f90:1000:22:
gyy,gyz,gzz,u,det,alp,beta,densl,sxl,syl,szl,taul,&
1
Warning: Unused dummy argument 'det' at (1) [-Wunused-dummy-argument]
COMPILING EinsteinEvolve/GRHydro/src/GRHydro_ENOReconstruct.F90
COMPILING EinsteinEvolve/GRHydro/src/GRHydro_FluxSplit.F90
COMPILING EinsteinEvolve/GRHydro/src/GRHydro_HLLE.F90
COMPILING EinsteinEvolve/GRHydro/src/GRHydro_HLLC.F90
COMPILING EinsteinEvolve/GRHydro/src/GRHydro_PPM.F90
/home/jenkins/workspace/EinsteinToolkit/configs/sim/build/GRHydro/GRHydro_PPM.f90:18:10:
nx,dx,rho,velx,vely,velz,eps,press,rhominus,&
1
Warning: Unused dummy argument 'dx' at (1) [-Wunused-dummy-argument]
/home/jenkins/workspace/EinsteinToolkit/configs/sim/build/GRHydro/GRHydro_PPM.f90:2439:10:
nx,dx,velx,temperature,press,&
1
Warning: Unused dummy argument 'dx' at (1) [-Wunused-dummy-argument]
/home/jenkins/workspace/EinsteinToolkit/configs/sim/build/GRHydro/GRHydro_PPM.f90:3865:49:
subroutine SimplePPM_tracer_1d(apply_enhanced_ppm,&
1
Warning: Unused dummy argument 'apply_enhanced_ppm' at (1) [-Wunused-dummy-argument]
/home/jenkins/workspace/EinsteinToolkit/configs/sim/build/GRHydro/GRHydro_PPM.f90:3866:10:
nx,dx,rho,velx,vely,velz, &
1
Warning: Unused dummy argument 'dx' at (1) [-Wunused-dummy-argument]
/home/jenkins/workspace/EinsteinToolkit/configs/sim/build/GRHydro/GRHydro_PPM.f90:3866:14:
nx,dx,rho,velx,vely,velz, &
1
Warning: Unused dummy argument 'rho' at (1) [-Wunused-dummy-argument]
/home/jenkins/workspace/EinsteinToolkit/configs/sim/build/GRHydro/GRHydro_PPM.f90:3866:24:
nx,dx,rho,velx,vely,velz, &
1
Warning: Unused dummy argument 'vely' at (1) [-Wunused-dummy-argument]
/home/jenkins/workspace/EinsteinToolkit/configs/sim/build/GRHydro/GRHydro_PPM.f90:3866:29:
nx,dx,rho,velx,vely,velz, &
1
Warning: Unused dummy argument 'velz' at (1) [-Wunused-dummy-argument]
/home/jenkins/workspace/EinsteinToolkit/configs/sim/build/GRHydro/GRHydro_PPM.f90:5071:10:
nx,dx,rho,velx,vely,velz, &
1
Warning: Unused dummy argument 'dx' at (1) [-Wunused-dummy-argument]
/home/jenkins/workspace/EinsteinToolkit/configs/sim/build/GRHydro/GRHydro_PPM.f90:5071:14:
nx,dx,rho,velx,vely,velz, &
1
Warning: Unused dummy argument 'rho' at (1) [-Wunused-dummy-argument]
/home/jenkins/workspace/EinsteinToolkit/configs/sim/build/GRHydro/GRHydro_PPM.f90:5071:24:
nx,dx,rho,velx,vely,velz, &
1
Warning: Unused dummy argument 'vely' at (1) [-Wunused-dummy-argument]
/home/jenkins/workspace/EinsteinToolkit/configs/sim/build/GRHydro/GRHydro_PPM.f90:5071:29:
nx,dx,rho,velx,vely,velz, &
1
Warning: Unused dummy argument 'velz' at (1) [-Wunused-dummy-argument]
COMPILING EinsteinEvolve/GRHydro/src/GRHydro_RoeSolver.F90
COMPILING EinsteinEvolve/GRHydro/src/GRHydro_Con2PrimM.F90
COMPILING EinsteinEvolve/GRHydro/src/GRHydro_WENOReconstruct.F90
/home/jenkins/workspace/EinsteinToolkit/configs/sim/build/GRHydro/GRHydro_WENOReconstruct.f90:3702:42:
subroutine GRHydro_WENOReconstruct1d(order, nx, v, vminus, vplus, trivial_rp, &
1
Warning: Unused dummy argument 'order' at (1) [-Wunused-dummy-argument]
Updating /home/jenkins/workspace/EinsteinToolkit/configs/sim/lib/libthorn_GRHydro.a
Makefile:259: recipe for target 'sim' failed
make: *** [sim] Error 2
Build step 'Execute shell' marked build as failure
Archiving artifacts
Recording test results
ERROR: Step ?Publish JUnit test result report? failed: Test reports were found but none of them are new. Did leafNodes run?
For example, /home/jenkins/workspace/EinsteinToolkit/testresults.xml is 2 hr 13 min old
IRC notifier plugin: Sending notification to: #cactus
IRC notifier plugin: [ERROR] not connected. Cannot send message to '#cactus'
Started calculate disk usage of build
Finished Calculation of disk usage of build in 0 seconds
Started calculate disk usage of workspace
Finished Calculation of disk usage of workspace in 5 second
Email was triggered for: Failure - 1st
Email was triggered for: Failure - Any
Trigger Failure - Any was overridden by another trigger and will not send an email.
Trigger Failure - Still was overridden by another trigger and will not send an email.
Sending email for trigger: Failure - 1st