BUILD FAILURE

Build URL:https://build.barrywardell.net/job/EinsteinToolkit/816/
Project:EinsteinToolkit
Date of build:Tue, 28 Jun 2016 14:18:19 +0000
Build duration:1 min 39 sec

Changes

No changes


Console Output


	[...truncated 2351 lines...]

	Checking status of thorn ML_BSSN_Test

	Checking status of thorn ML_CCZ4_Test

	Checking status of thorn ML_WaveToy_Test

	Checking status of thorn Meudon_Bin_BH

	Checking status of thorn Meudon_Bin_NS

	Checking status of thorn Meudon_Mag_NS

	Checking status of thorn MoL

	Checking status of thorn NaNCatcher

	Checking status of thorn NaNChecker

	Checking status of thorn NewRad

	Checking status of thorn Nice

	Checking status of thorn Noise

	Checking status of thorn Norms

	Checking status of thorn NullDecomp

	Checking status of thorn NullGrid

	Checking status of thorn NullVars

	Checking status of thorn OpenSSL

	Checking status of thorn Outflow

	Checking status of thorn PAPI

	Checking status of thorn TATelliptic

	Checking status of thorn PunctureTracker

	Checking status of thorn TGRtensor

	Checking status of thorn ReductionTest

	Checking status of thorn ReductionTest2

	Checking status of thorn ReductionTest3

	Checking status of thorn ReflectionSymmetry

	Checking status of thorn RegridSyncTest

	Checking status of thorn RotatingDBHIVP

	Checking status of thorn SampleBoundary

	Checking status of thorn SampleIO

	Checking status of thorn Seed_Magnetic_Fields

	Checking status of thorn SetMask_SphericalSurface

	Checking status of thorn SlabTest

	Checking status of thorn StaticConformal

	Checking status of thorn SummationByParts

	Checking status of thorn SymBase

	Checking status of thorn SystemStatistics

	Checking status of thorn TerminationTrigger

	Checking status of thorn TestArrays

	Checking status of thorn TestComplex

	Checking status of thorn TestCoordinates

	Checking status of thorn TestFortranCrayPointers

	Checking status of thorn TestFortranDependencies2

	Checking status of thorn TestFpointerNULL

	Checking status of thorn TestFreeF90

	Checking status of thorn TestGlobalReduce

	Checking status of thorn TestInclude1

	Checking status of thorn TestInclude2

	Checking status of thorn TestLocalInterp2

	Checking status of thorn TestLocalReduce

	Checking status of thorn TestLoop

	Checking status of thorn TestMath

	Checking status of thorn TestMoL

	COMPILING arrangements/CactusTest/TestLoop/src/TestLoopCXXVectorized.cc

	Checking status of thorn TestPar

	COMPILING arrangements/CactusTest/TestLoop/src/TestLoopPointwise.c

	Checking status of thorn TestReduce

	/home/jenkins/workspace/EinsteinToolkit/arrangements/CactusTest/TestLoop/src/TestLoopCXXVectorized.cc: In function ‘void TestLoopCXXVectorized2(cGH*)’:

	/home/jenkins/workspace/EinsteinToolkit/arrangements/CactusTest/TestLoop/src/TestLoopCXXVectorized.cc:150:24: error: ‘loop3strmod_all’ was not declared in this scope

	/home/jenkins/workspace/EinsteinToolkit/arrangements/CactusTest/TestLoop/src/TestLoopCXXVectorized.cc:151:32: error: ‘i’ was not declared in this scope

	/home/jenkins/workspace/EinsteinToolkit/arrangements/CactusTest/TestLoop/src/TestLoopCXXVectorized.cc:151:34: error: ‘j’ was not declared in this scope

	/home/jenkins/workspace/EinsteinToolkit/arrangements/CactusTest/TestLoop/src/TestLoopCXXVectorized.cc:151:36: error: ‘k’ was not declared in this scope

	/home/jenkins/workspace/EinsteinToolkit/arrangements/CactusTest/TestLoop/src/TestLoopCXXVectorized.cc:151:39: error: ‘imin’ was not declared in this scope

	/home/jenkins/workspace/EinsteinToolkit/arrangements/CactusTest/TestLoop/src/TestLoopCXXVectorized.cc:151:44: error: ‘imax’ was not declared in this scope

	/home/jenkins/workspace/EinsteinToolkit/arrangements/CactusTest/TestLoop/src/TestLoopCXXVectorized.cc:151:63: error: ‘CCTK_LOOP3STRMOD_ALL’ was not declared in this scope

	/home/jenkins/workspace/EinsteinToolkit/arrangements/CactusTest/TestLoop/src/TestLoopCXXVectorized.cc:152:3: error: expected ‘;’ before ‘{’ token

	/home/jenkins/workspace/EinsteinToolkit/arrangements/CactusTest/TestLoop/src/TestLoopCXXVectorized.cc:146:8: warning: unused variable ‘alignment_error’ [-Wunused-variable]

	/home/jenkins/workspace/EinsteinToolkit/arrangements/CactusTest/TestLoop/src/TestLoopCXXVectorized.cc:167:52: error: expected ‘}’ before end of line

	/home/jenkins/workspace/EinsteinToolkit/arrangements/CactusTest/TestLoop/src/TestLoopCXXVectorized.cc: At global scope:

	/home/jenkins/workspace/EinsteinToolkit/arrangements/CactusTest/TestLoop/src/TestLoopCXXVectorized.cc:167:52: error: expected declaration before end of line

	make[3]: *** [TestLoopCXXVectorized.cc.o] Error 1

	make[3]: *** Waiting for unfinished jobs....

	COMPILING arrangements/CactusTest/TestReduce/src/Reduce_Maximum.c

	COMPILING arrangements/CactusTest/TestReduce/src/Reduce_Sum.c

	COMPILING arrangements/CactusTest/TestReduce/src/Reduce_Maximum.F77

	make[2]: *** [make.checked] Error 2

	make[1]: *** [/home/jenkins/workspace/EinsteinToolkit/configs/sim/lib/libthorn_TestLoop.a] Error 2

	make[1]: *** Waiting for unfinished jobs....

	COMPILING arrangements/CactusTest/TestReduce/src/Reduce_Sum.F77

	COMPILING arrangements/CactusTest/TestReduce/src/Initial.c

	Updating /home/jenkins/workspace/EinsteinToolkit/configs/sim/lib/libthorn_TestReduce.a

	make: *** [sim] Error 2

	Build step 'Execute shell' marked build as failure

	Archiving artifacts

	Recording test results

	ERROR: Step ‘Publish JUnit test result report’ failed: Test reports were found but none of them are new. Did tests run?

	For example, /home/jenkins/workspace/EinsteinToolkit/testresults.xml is 23 hr old

	

	IRC notifier plugin: Sending notification to: #cactus

	IRC notifier plugin: [ERROR] not connected. Cannot send message to '#cactus'

	[BFA] Scanning build for known causes...

	[BFA] No failure causes found

	[BFA] Done. 0s

	Started calculate disk usage of build

	Finished Calculation of disk usage of build in 0 seconds

	Started calculate disk usage of workspace

	Finished Calculation of disk usage of workspace in  5 second

	Email was triggered for: Failure - Any

	Sending email for trigger: Failure - Any