BUILD FAILURE

Build URL:https://build.barrywardell.net/job/EinsteinToolkit/1713/
Project:EinsteinToolkit
Date of build:Mon, 17 Aug 2020 17:58:04 +0000
Build duration:32 min

Changes

Revision: 7c0e68081538d667ee0d264b4935d2505378edaf
Author:Roland Haas
Log:
updated submodules

Submodule repos/ReadInterpolate a3cfcc9..1bf3a9f:
  > ReadInterpolate: add documnetation


Console Output


	[...truncated 744.28 KB...]

	COMPILING McLachlan/ML_BSSN/src/ML_BSSN_ConstraintsEverywhere.cc

	COMPILING McLachlan/ML_BSSN/src/ML_BSSN_ConstraintsInterior.cc

	COMPILING configs/sim/bindings/build/ML_BSSN/cctk_ThornBindings.c

	Checking status of thorn ML_CCZ4

	COMPILING McLachlan/ML_CCZ4/src/Boundaries.cc

	COMPILING McLachlan/ML_CCZ4/src/Kranc.cc

	COMPILING McLachlan/ML_CCZ4/src/ML_CCZ4_ADMBaseBoundaryScalar.cc

	COMPILING McLachlan/ML_CCZ4/src/ML_CCZ4_ADMBaseEverywhere.cc

	COMPILING McLachlan/ML_CCZ4/src/ML_CCZ4_ADMBaseInterior.cc

	COMPILING McLachlan/ML_CCZ4/src/ML_CCZ4_ConstraintsEverywhere.cc

	COMPILING McLachlan/ML_CCZ4/src/ML_CCZ4_ConstraintsInterior.cc

	COMPILING McLachlan/ML_BSSN/src/ML_BSSN_EnforceEverywhere.cc

	COMPILING McLachlan/ML_BSSN/src/ML_BSSN_EvolutionAnalysisInit.cc

	COMPILING McLachlan/ML_BSSN/src/ML_BSSN_EvolutionAnalysisInterior.cc

	COMPILING McLachlan/ML_CCZ4/src/ML_CCZ4_EnforceEverywhere.cc

	COMPILING McLachlan/ML_CCZ4/src/ML_CCZ4_EvolutionAnalysisInit.cc

	COMPILING McLachlan/ML_CCZ4/src/ML_CCZ4_EvolutionAnalysisInterior.cc

	COMPILING McLachlan/ML_BSSN/src/ML_BSSN_EvolutionBoundaryScalar.cc

	COMPILING McLachlan/ML_BSSN/src/ML_BSSN_EvolutionInterior.cc

	COMPILING McLachlan/ML_CCZ4/src/ML_CCZ4_EvolutionBoundaryScalar.cc

	COMPILING McLachlan/ML_CCZ4/src/ML_CCZ4_EvolutionInterior.cc

	COMPILING McLachlan/ML_BSSN/src/ML_BSSN_EvolutionInteriorSplitBy1.cc

	COMPILING McLachlan/ML_BSSN/src/ML_BSSN_EvolutionInteriorSplitBy2.cc

	COMPILING McLachlan/ML_CCZ4/src/ML_CCZ4_EvolutionInteriorSplitBy1.cc

	COMPILING McLachlan/ML_BSSN/src/ML_BSSN_EvolutionInteriorSplitBy3.cc

	FATAL: command execution failed

	java.io.EOFException

	at java.io.ObjectInputStream$PeekInputStream.readFully(ObjectInputStream.java:2760)

	at java.io.ObjectInputStream$BlockDataInputStream.readShort(ObjectInputStream.java:3235)

	at java.io.ObjectInputStream.readStreamHeader(ObjectInputStream.java:914)

	at java.io.ObjectInputStream.<init>(ObjectInputStream.java:376)

	at hudson.remoting.ObjectInputStreamEx.<init>(ObjectInputStreamEx.java:49)

	at hudson.remoting.Command.readFrom(Command.java:142)

	at hudson.remoting.Command.readFrom(Command.java:128)

	at hudson.remoting.AbstractSynchronousByteArrayCommandTransport.read(AbstractSynchronousByteArrayCommandTransport.java:35)

	at hudson.remoting.SynchronousCommandTransport$ReaderThread.run(SynchronousCommandTransport.java:63)

	Caused: java.io.IOException: Unexpected termination of the channel

	at hudson.remoting.SynchronousCommandTransport$ReaderThread.run(SynchronousCommandTransport.java:77)

	Caused: java.io.IOException: Backing channel 'ncsa-20.04' is disconnected.

	at hudson.remoting.RemoteInvocationHandler.channelOrFail(RemoteInvocationHandler.java:216)

	at hudson.remoting.RemoteInvocationHandler.invoke(RemoteInvocationHandler.java:285)

	at com.sun.proxy.$Proxy78.isAlive(Unknown Source)

	at hudson.Launcher$RemoteLauncher$ProcImpl.isAlive(Launcher.java:1147)

	at hudson.Launcher$RemoteLauncher$ProcImpl.join(Launcher.java:1139)

	at hudson.tasks.CommandInterpreter.join(CommandInterpreter.java:155)

	at hudson.tasks.CommandInterpreter.perform(CommandInterpreter.java:109)

	at hudson.tasks.CommandInterpreter.perform(CommandInterpreter.java:66)

	at hudson.tasks.BuildStepMonitor$1.perform(BuildStepMonitor.java:20)

	at hudson.model.AbstractBuild$AbstractBuildExecution.perform(AbstractBuild.java:741)

	at hudson.model.Build$BuildExecution.build(Build.java:206)

	at hudson.model.Build$BuildExecution.doRun(Build.java:163)

	at hudson.model.AbstractBuild$AbstractBuildExecution.run(AbstractBuild.java:504)

	at hudson.model.Run.execute(Run.java:1880)

	at hudson.model.FreeStyleBuild.run(FreeStyleBuild.java:43)

	at hudson.model.ResourceController.execute(ResourceController.java:97)

	at hudson.model.Executor.run(Executor.java:428)

	FATAL: Unable to delete script file /tmp/jenkins9963270201953207700.sh

	java.io.EOFException

	at java.io.ObjectInputStream$PeekInputStream.readFully(ObjectInputStream.java:2760)

	at java.io.ObjectInputStream$BlockDataInputStream.readShort(ObjectInputStream.java:3235)

	at java.io.ObjectInputStream.readStreamHeader(ObjectInputStream.java:914)

	at java.io.ObjectInputStream.<init>(ObjectInputStream.java:376)

	at hudson.remoting.ObjectInputStreamEx.<init>(ObjectInputStreamEx.java:49)

	at hudson.remoting.Command.readFrom(Command.java:142)

	at hudson.remoting.Command.readFrom(Command.java:128)

	at hudson.remoting.AbstractSynchronousByteArrayCommandTransport.read(AbstractSynchronousByteArrayCommandTransport.java:35)

	at hudson.remoting.SynchronousCommandTransport$ReaderThread.run(SynchronousCommandTransport.java:63)

	Caused: java.io.IOException: Unexpected termination of the channel

	at hudson.remoting.SynchronousCommandTransport$ReaderThread.run(SynchronousCommandTransport.java:77)

	Caused: hudson.remoting.ChannelClosedException: Channel "hudson.remoting.Channel@45fec0c2:ncsa-20.04": Remote call on ncsa-20.04 failed. The channel is closing down or has closed down

	at hudson.remoting.Channel.call(Channel.java:991)

	at hudson.FilePath.act(FilePath.java:1069)

	at hudson.FilePath.act(FilePath.java:1058)

	at hudson.FilePath.delete(FilePath.java:1543)

	at hudson.tasks.CommandInterpreter.perform(CommandInterpreter.java:123)

	at hudson.tasks.CommandInterpreter.perform(CommandInterpreter.java:66)

	at hudson.tasks.BuildStepMonitor$1.perform(BuildStepMonitor.java:20)

	at hudson.model.AbstractBuild$AbstractBuildExecution.perform(AbstractBuild.java:741)

	at hudson.model.Build$BuildExecution.build(Build.java:206)

	at hudson.model.Build$BuildExecution.doRun(Build.java:163)

	at hudson.model.AbstractBuild$AbstractBuildExecution.run(AbstractBuild.java:504)

	at hudson.model.Run.execute(Run.java:1880)

	at hudson.model.FreeStyleBuild.run(FreeStyleBuild.java:43)

	at hudson.model.ResourceController.execute(ResourceController.java:97)

	at hudson.model.Executor.run(Executor.java:428)

	Build step 'Execute shell' marked build as failure

	ERROR: Step ?Archive the artifacts? failed: no workspace for EinsteinToolkit #1713

	ERROR: Step ?Console output (build log) parsing? failed: no workspace for EinsteinToolkit #1713

	ERROR: Step ?Publish JUnit test result report? failed: no workspace for EinsteinToolkit #1713

	ERROR: Step ?Allow broken build claiming? failed: no workspace for EinsteinToolkit #1713

	IRC notifier plugin: Sending notification to: #cactus

	IRC notifier plugin: [ERROR] not connected. Cannot send message to '#cactus'

	Started calculate disk usage of build

	Finished Calculation of disk usage of build in 0 seconds

	Email was triggered for: Failure - 1st

	Email was triggered for: Failure - Any

	Trigger Failure - Any was overridden by another trigger and will not send an email.

	Trigger Failure - Still was overridden by another trigger and will not send an email.

	Sending email for trigger: Failure - 1st