BUILD FAILURE

Build URL:https://build.barrywardell.net/job/EinsteinToolkit/766/
Project:EinsteinToolkit
Date of build:Mon, 16 May 2016 15:37:43 +0000
Build duration:55 sec

Changes

Revision: d2f3f26d0d3a15d10e5c300c85da98c392ab176e
Author:Barry Wardell
Log:
Correct URL for CTThorns


Console Output


	[...truncated 2434 lines...]

	Checking status of thorn ML_CCZ4_Helper

	Checking status of thorn NullInterp

	Checking status of thorn TestFortranDependencies1

	Checking status of thorn WaveMoL

	Checking status of thorn WaveToyC

	Checking status of thorn WaveToyCXX

	Checking status of thorn WaveToyF77

	Checking status of thorn WaveToyF90

	Checking status of thorn WaveToyFreeF90

	Checking status of thorn ADMAnalysis

	Checking status of thorn ADMBase

	Checking status of thorn AHFinder

	Checking status of thorn MPI

	Checking status of thorn SpaceMask

	Checking status of thorn LoopControl

	Checking status of thorn CalcK

	Checking status of thorn CarpetMask

	Checking status of thorn Cartoon2D

	Checking status of thorn EOS_Hybrid

	Checking status of thorn PETSc

	Checking status of thorn PUGH

	Checking status of thorn Formaline

	Checking status of thorn GaugeWave

	Checking status of thorn HTTPD

	Checking status of thorn Hydro_Analysis

	Checking status of thorn KerrSchild

	Checking status of thorn ML_ADMConstraints

	Checking status of thorn ML_ADMQuantities

	Checking status of thorn ML_BSSN

	Checking status of thorn ML_CCZ4

	Checking status of thorn ML_WaveToy

	Checking status of thorn MemSpeed

	Checking status of thorn Minkowski

	Checking status of thorn ModifiedSchwarzschildBL

	Checking status of thorn NoMPI

	Checking status of thorn NullEvolve

	Checking status of thorn NullNews

	Checking status of thorn PUGHInterp

	Checking status of thorn PUGHReduce

	Checking status of thorn PUGHSlab

	Checking status of thorn Slab

	Checking status of thorn QuasiLocalMeasures

	Checking status of thorn RotatingSymmetry180

	Checking status of thorn RotatingSymmetry90

	Checking status of thorn ShiftedGaugeWave

	Checking status of thorn SystemTopology

	Checking status of thorn TOVSolver

	Checking status of thorn TestLoopControl

	Checking status of thorn TimerReport

	Checking status of thorn Vaidya2

	Checking status of thorn WeylScal4

	Checking status of thorn Cactus

	/home/jenkins/workspace/EinsteinToolkit/arrangements/EinsteinAnalysis/QuasiLocalMeasures/src/qlm_import_surface.F90:96:2: warning: #warning "TODO: Ensure that the surface parameters don't change" [-Wcpp]

	Checking status of thorn HDF5

	Checking status of thorn CT_Analytic

	Checking status of thorn CarpetLib

	Checking status of thorn EOS_Omni

	Checking status of thorn EllPETSc

	Checking status of thorn HTTPDExtra

	Checking status of thorn IOHDF5Util

	Checking status of thorn IllinoisGRMHD

	Checking status of thorn Multipole

	Checking status of thorn NullConstr

	Checking status of thorn NullExact

	Checking status of thorn NullPsiInt

	Checking status of thorn NullSHRExtract

	Checking status of thorn Periodic

	Checking status of thorn SphericalHarmonicDecomp

	/home/jenkins/workspace/EinsteinToolkit/arrangements/Carpet/CarpetLib/src/data.cc:99:2: error: #endif without #if

	Checking status of thorn SphericalHarmonicRecon

	Checking status of thorn SphericalHarmonicReconGen

	COMPILING arrangements/Carpet/CarpetLib/src/data.cc

	COMPILING arrangements/Carpet/CarpetLib/src/dist.cc

	/home/jenkins/workspace/EinsteinToolkit/arrangements/Carpet/CarpetLib/src/data.cc:99:2: error: #endif without #if

	COMPILING arrangements/Carpet/CarpetLib/src/gdata.cc

	Creating Formaline tarball for thorn FFTW3

	make[3]: *** [data.cc.o] Error 1

	make[3]: *** Waiting for unfinished jobs....

	make[2]: *** [make.checked] Error 2

	make[1]: *** [/home/jenkins/workspace/EinsteinToolkit/configs/sim/lib/libthorn_CarpetLib.a] Error 2

	make[1]: *** Waiting for unfinished jobs....

	make: *** [sim] Error 2

	Build step 'Execute shell' marked build as failure

	Archiving artifacts

	Recording test results

	ERROR: Step ‘Publish JUnit test result report’ failed: Test reports were found but none of them are new. Did tests run?

	For example, /home/jenkins/workspace/EinsteinToolkit/testresults.xml is 2 days 18 hr old

	

	IRC notifier plugin: Sending notification to: #cactus

	IRC notifier plugin: [ERROR] not connected. Cannot send message to '#cactus'

	[BFA] Scanning build for known causes...

	[BFA] No failure causes found

	[BFA] Done. 0s

	Started calculate disk usage of build

	Finished Calculation of disk usage of build in 0 seconds

	Started calculate disk usage of workspace

	Finished Calculation of disk usage of workspace in  2 second

	Email was triggered for: Failure - Any

	Sending email for trigger: Failure - Any