BUILD FAILURE

Build URL:https://jenkins.einsteintoolkit.ncsa.illinois.edu/job/EinsteinToolkit/1732/
Project:EinsteinToolkit
Date of build:Mon, 14 Sep 2020 12:57:24 +0000
Build duration:2 min 49 sec

Changes

Revision: f95ae0b62aa37b6f9619ed45b2fd0ec381d301cb
Author:rhaas
Log:
updated submodules

Submodule arrangements/CactusNumerical 4ad768f..8666c24:
  > RotatingSymmetry90: regenerate constraints data
  > RotatingSymmetry90: replace ADMConstraints with ML_ADMConstraints in test
  > RotatingSymmetry180: regenerate constraints data
  > RotatingSymmstry180: replace ADMConstraints by ML_ADMConstraints in test
  > Dissipation: remove ADMCoupling from tests
  > RotatingSymmetry90: remove ADMCoupling from tests
  > RotatingSymmetry180: remove ADMCoupling from tests
  > Cartoon2D: remove ADMConstraints from test parfiles
  > Cartoon2D: remove ADMCoupling from tests
  > Cartoon2D: update schw-050 test data after McLachlan rewrite
Submodule arrangements/CactusUtils 78427d5..6443411:
  > Trigger: remove ADMCoupling from tests
Submodule arrangements/EinsteinAnalysis 3df424f..1352199:
  > ADMMass: remove unused ADMConstraints thorn from test
  > Outflow: remove ADMCoupling from tests
  > Hydro_Analysis: remove ADMCoupling from tests
  > AHFinderDirect: remove ADMCoupling from tests
  > QuasiLocalMeasures: remove ADMCoupling from tests
  > Extract: remove ADMCoupling from tests
  > WeylScal4: remove ADMCoupling from tests
  > ADMMass: remove ADMCoupling from tests
Submodule arrangements/EinsteinBase 9ea098c..5a412c0:
  > TmunuBase: remove deprecated support for old CalcTmunu mechanism
Submodule arrangements/EinsteinEvolve ac5b9b5..6adaab9:
  > GRHydro: regenerate constraint data for tests that used ADMConstraints
  > GRHydro: use ML_ADMConstraints in tests
  > GRHydro: remove ADMCoupling from tests
  > GRHydro_InitData: remove ADMCoupling from tests
  > GRHydro: remove ADMCoupling from tests
Submodule arrangements/Lean 1e8b881..303a845:
  > LeanBSSNMoL: remove ADMCoupling from tests
  > NPScalars: remove ADMCoupling from tests
Submodule arrangements/Proca ca2876b..b844285:
  > NPScalars_Proca: remove ADMCoupling and ADMMacros from tests
  > ProcaEvolve: remove ADMCoupling and ADMMacros from tests
  > Proca_simpleID: remove ADMCoupling and ADMMacros from tests
  > TwoPunctures_KerrProca: remove ADMCoupling and ADMMacros from tests
Submodule arrangements/WVUThorns b826f65..c233ed6:
  > GiRaFFE: remove ADMCoupling from tests
  > BaikalVacuum: remove ADMCoupling from tests
  > IllinoisGRMHD: remove ADMCoupling from tests
  > FishboneMoncriefID: remove ADMCoupling from tests
  > Baikal: remove ADMCoupling from tests
Submodule arrangements/WVUThorns_Diagnostics 052fb20..86870d7:
  > smallbPoynET: remove ADMCoupling from tests
  > VolumeIntegrals_vacuum: remove ADMCoupling from tests
  > VolumeIntegrals_GRMHD: remove ADMCoupling from tests
  > particle_tracerET: remove ADMCoupling from tests
  > Seed_Magnetic_Fields_BNS: remove ADMCoupling from tests
Submodule repos/EinsteinExact 0d400ba..e3f303f:
  > EinsteinExact_Test: regenerate constraints test data
  > EinsteinExact_Test: replace ADMConstraints with ML_ADMConstraints in test
  > EinsteinExact_Test: remove ADMCoupling from tests
Submodule repos/EinsteinInitialData 8cdd934..5191f6c:
  > IDConstrainViolate: regenerate test data
  > IDConstraintViolate: replace ADMConstraints by ML_ADMConstraints in test
  > TOVSolver: regenerate test data
  > TOVSolver: replace ADMConstraints by ML_ADMConstraints in tests
  > TwoPunctures: regenerate constraint data
  > TwoPunctures: replace ADMConstraints by ML_ADMConstraints in test
  > TOVSolver:: remove ADMCoupling from tests
  > IDConstraintViolate: remove ADMCoupling from tests
  > IDAxiBrillBH: remove ADMCoupling from tests
  > Hydro_InitExcision: remove ADMCoupling from tests
  > TOVSolver: remove ADMCoupling from tests
  > RotatingDBHIVP: remove ADMCoupling from tests
  > DistortedBHIVP: remove ADMCoupling from tests
  > TwoPunctures: remove ADMCoupling from tests
  > IDAxiOddBrillBH: remove ADMCoupling from tests
  > Exact: regenerate deSitter test data
  > Exact: use ML_ADMConstraints instead of ADMConstraints
  > Exact: remove ADMCoupling from tests
  > Exact: fix adding to Tmunu grid functions
  > Exact: no longer be FRIEND with ADMCoupling
  > Exact: convert tmunu source for to free-form Fortran
  > Exact: switch to new Tmunu interface
Submodule repos/McLachlan c5cb2ff..dd0d303:
  > ML_BSSN_Test: remove ADMCoupling from tests
  > ML_CCZ4_Test: remove ADMCoupling from tests
Submodule repos/carpet 933b292..785b952:
  > CarpetRegrid2: remove ADMCoupling from tests
  > CarpetRegrid: remove ADMCoupling from tests
  > CarpetEvolutionMask: remove ADMCoupling from tests
  > LoopControl: remove ADMCoupling from tests
  > PeriodicCarpet: remove ADMCoupling from tests
  > CarpetRegridTest: remove ADMCoupling from tests
  > Carpet: remove ADMCoupling from tests


Console Output


	[...truncated 140.15 KB...]

	Checking status of thorn LeanBSSNMoL

	Checking status of thorn LocalInterp

	Checking status of thorn LocalInterp2

	Checking status of thorn LocalReduce

	Checking status of thorn ML_BSSN_Test

	Checking status of thorn ML_CCZ4_Test

	Checking status of thorn ML_WaveToy_Test

	Checking status of thorn Meudon_Bin_BH

	Checking status of thorn Meudon_Bin_NS

	Checking status of thorn Meudon_Mag_NS

	Checking status of thorn MoL

	Checking status of thorn NPScalars

	Checking status of thorn NPScalars_Proca

	Checking status of thorn NaNCatcher

	Checking status of thorn NaNChecker

	Checking status of thorn NewRad

	Checking status of thorn Nice

	Checking status of thorn Noise

	Checking status of thorn Norms

	Checking status of thorn NullDecomp

	Checking status of thorn NullGrid

	Checking status of thorn NullVars

	Checking status of thorn OpenSSL

	Checking status of thorn Outflow

	Checking status of thorn PAPI

	Checking status of thorn TATelliptic

	Checking status of thorn ProcaBase

	Checking status of thorn ProcaEvolve

	Checking status of thorn Proca_simpleID

	Checking status of thorn PunctureTracker

	Checking status of thorn ReductionTest

	Checking status of thorn ReductionTest2

	Checking status of thorn ReductionTest3

	Checking status of thorn ReflectionSymmetry

	Checking status of thorn RegridSyncTest

	Checking status of thorn RotatingDBHIVP

	Checking status of thorn SampleBoundary

	Checking status of thorn SampleIO

	Checking status of thorn Seed_Magnetic_Fields

	Checking status of thorn Seed_Magnetic_Fields_BNS

	Checking status of thorn SetMask_SphericalSurface

	Checking status of thorn SlabTest

	Checking status of thorn StaticConformal

	Checking status of thorn SymBase

	Checking status of thorn SystemStatistics

	Checking status of thorn TerminationTrigger

	Checking status of thorn TestArrays

	Checking status of thorn TestComplex

	Checking status of thorn TestCoordinates

	Checking status of thorn TestFortranCrayPointers

	Checking status of thorn TestFortranDependencies2

	Checking status of thorn TestFpointerNULL

	Checking status of thorn TestFreeF90

	Checking status of thorn TestGlobalReduce

	Checking status of thorn TestInclude1

	Checking status of thorn TestInclude2

	Checking status of thorn TestLocalInterp2

	Checking status of thorn TestLocalReduce

	Checking status of thorn TestLoop

	Checking status of thorn TestMath

	Checking status of thorn TestMoL

	Checking status of thorn TestPar

	Checking status of thorn TestReadWrite

	Checking status of thorn TestReduce

	Checking status of thorn TestSchedule

	Checking status of thorn TestStrings

	Checking status of thorn TestTable

	Checking status of thorn TestTimers

	Checking status of thorn TestTypes

	Checking status of thorn Time

	Checking status of thorn TimerInfo

	Checking status of thorn TmunuBase

	Checking status of thorn Trigger

	make[3]: *** No rule to make target 'ParamWarn.c.o', needed by 'make.checked'.  Stop.

	make[2]: *** [/home/jenkins/workspace/EinsteinToolkit/lib/make/make.thornlib:113: make.checked] Error 2

	make[1]: *** [/home/jenkins/workspace/EinsteinToolkit/lib/make/make.configuration:179: /home/jenkins/workspace/EinsteinToolkit/configs/sim/lib/libthorn_TmunuBase.a] Error 2

	make[1]: *** Waiting for unfinished jobs....

	make: *** [Makefile:264: sim] Error 2

	

	real	2m0.898s

	user	1m49.196s

	sys	0m23.808s

	

	real	2m3.074s

	user	1m50.736s

	sys	0m24.148s

	Build step 'Execute shell' marked build as failure

	Archiving artifacts

	Recording test results

	ERROR: Step ?Publish JUnit test result report? failed: Test reports were found but none of them are new. Did leafNodes run?

	For example, /home/jenkins/workspace/EinsteinToolkit/testresults.xml is 1 day 18 hr old

	

	Started calculate disk usage of build

	Finished Calculation of disk usage of build in 0 seconds

	Started calculate disk usage of workspace

	Finished Calculation of disk usage of workspace in  8 second

	[Checks API] No suitable checks publisher found.

	Email was triggered for: Failure - Any

	Sending email for trigger: Failure - Any