BUILD FAILURE
| Build URL: | https://build.barrywardell.net/job/EinsteinToolkit/799/ |
| Project: | EinsteinToolkit |
| Date of build: | Tue, 07 Jun 2016 09:51:53 +0000 |
| Build duration: | 34 min |
| Revision: | 7b271fdd1e4a5efc72bb264c44f67876e31b68cb |
| Author: | Einstein Toolkit Git Server |
| Log: | Updated submodules: * arrangements/ExternalLibraries/PETSc 8d71e4d...12e8bf1 (1): > remove u from ARFLAGS instead of unsetting it |
[...truncated 12231 lines...] "CactusTest/TestMoL/test/RK4-MR-2-1.par" Issuing rm -f output-0000-active && ln -s . output-0000-active && mkdir -p SIMFACTORY && TESTSUITE_PARFILE=/home/jenkins/workspace/simulations/EinsteinToolkit_7b271fdd1e4a5efc72bb264c44f67876e31b68cb_2/output-0000/arrangements/CactusTest/TestMoL/test/RK4-MR-2-1.par /home/jenkins/workspace/EinsteinToolkit/../simulations/EinsteinToolkit_7b271fdd1e4a5efc72bb264c44f67876e31b68cb_2/output-0000/SIMFACTORY/RunScript Success: 10 files identical ------------------------------------------------------------------------ Test TestMoL: RK4-RK2 "CactusTest/TestMoL/test/RK4-RK2.par" Issuing rm -f output-0000-active && ln -s . output-0000-active && mkdir -p SIMFACTORY && TESTSUITE_PARFILE=/home/jenkins/workspace/simulations/EinsteinToolkit_7b271fdd1e4a5efc72bb264c44f67876e31b68cb_2/output-0000/arrangements/CactusTest/TestMoL/test/RK4-RK2.par /home/jenkins/workspace/EinsteinToolkit/../simulations/EinsteinToolkit_7b271fdd1e4a5efc72bb264c44f67876e31b68cb_2/output-0000/SIMFACTORY/RunScript Success: 10 files identical ------------------------------------------------------------------------ Test TestMoL: RK4 "CactusTest/TestMoL/test/RK4.par" Issuing rm -f output-0000-active && ln -s . output-0000-active && mkdir -p SIMFACTORY && TESTSUITE_PARFILE=/home/jenkins/workspace/simulations/EinsteinToolkit_7b271fdd1e4a5efc72bb264c44f67876e31b68cb_2/output-0000/arrangements/CactusTest/TestMoL/test/RK4.par /home/jenkins/workspace/EinsteinToolkit/../simulations/EinsteinToolkit_7b271fdd1e4a5efc72bb264c44f67876e31b68cb_2/output-0000/SIMFACTORY/RunScript Success: 12 files identical ------------------------------------------------------------------------ Test TestMoL: RK45 "CactusTest/TestMoL/test/RK45.par" Issuing rm -f output-0000-active && ln -s . output-0000-active && mkdir -p SIMFACTORY && TESTSUITE_PARFILE=/home/jenkins/workspace/simulations/EinsteinToolkit_7b271fdd1e4a5efc72bb264c44f67876e31b68cb_2/output-0000/arrangements/CactusTest/TestMoL/test/RK45.par /home/jenkins/workspace/EinsteinToolkit/../simulations/EinsteinToolkit_7b271fdd1e4a5efc72bb264c44f67876e31b68cb_2/output-0000/SIMFACTORY/RunScript Success: 6 files identical ------------------------------------------------------------------------ Test TestMoL: RK45CK "CactusTest/TestMoL/test/RK45CK.par" Issuing rm -f output-0000-active && ln -s . output-0000-active && mkdir -p SIMFACTORY && TESTSUITE_PARFILE=/home/jenkins/workspace/simulations/EinsteinToolkit_7b271fdd1e4a5efc72bb264c44f67876e31b68cb_2/output-0000/arrangements/CactusTest/TestMoL/test/RK45CK.par /home/jenkins/workspace/EinsteinToolkit/../simulations/EinsteinToolkit_7b271fdd1e4a5efc72bb264c44f67876e31b68cb_2/output-0000/SIMFACTORY/RunScript Success: 6 files identical ------------------------------------------------------------------------ Test TestMoL: RK65 "CactusTest/TestMoL/test/RK65.par" Issuing rm -f output-0000-active && ln -s . output-0000-active && mkdir -p SIMFACTORY && TESTSUITE_PARFILE=/home/jenkins/workspace/simulations/EinsteinToolkit_7b271fdd1e4a5efc72bb264c44f67876e31b68cb_2/output-0000/arrangements/CactusTest/TestMoL/test/RK65.par /home/jenkins/workspace/EinsteinToolkit/../simulations/EinsteinToolkit_7b271fdd1e4a5efc72bb264c44f67876e31b68cb_2/output-0000/SIMFACTORY/RunScript Success: 6 files identical ------------------------------------------------------------------------ Test TestMoL: RK87 "CactusTest/TestMoL/test/RK87.par" Issuing rm -f output-0000-active && ln -s . output-0000-active && mkdir -p SIMFACTORY && TESTSUITE_PARFILE=/home/jenkins/workspace/simulations/EinsteinToolkit_7b271fdd1e4a5efc72bb264c44f67876e31b68cb_2/output-0000/arrangements/CactusTest/TestMoL/test/RK87.par /home/jenkins/workspace/EinsteinToolkit/../simulations/EinsteinToolkit_7b271fdd1e4a5efc72bb264c44f67876e31b68cb_2/output-0000/SIMFACTORY/RunScript Success: 6 files identical ------------------------------------------------------------------------ Test TestPar: expressions "CactusTest/TestPar/test/expressions.par" Issuing rm -f output-0000-active && ln -s . output-0000-active && mkdir -p SIMFACTORY && TESTSUITE_PARFILE=/home/jenkins/workspace/simulations/EinsteinToolkit_7b271fdd1e4a5efc72bb264c44f67876e31b68cb_2/output-0000/arrangements/CactusTest/TestPar/test/expressions.par /home/jenkins/workspace/EinsteinToolkit/../simulations/EinsteinToolkit_7b271fdd1e4a5efc72bb264c44f67876e31b68cb_2/output-0000/SIMFACTORY/RunScript Success: 1 files identical ------------------------------------------------------------------------ Test MemSpeed: memspeed "CactusUtils/MemSpeed/test/memspeed.par" Issuing rm -f output-0000-active && ln -s . output-0000-active && mkdir -p SIMFACTORY && TESTSUITE_PARFILE=/home/jenkins/workspace/simulations/EinsteinToolkit_7b271fdd1e4a5efc72bb264c44f67876e31b68cb_2/output-0000/arrangements/CactusUtils/MemSpeed/test/memspeed.par /home/jenkins/workspace/EinsteinToolkit/../simulations/EinsteinToolkit_7b271fdd1e4a5efc72bb264c44f67876e31b68cb_2/output-0000/SIMFACTORY/RunScript Slave went offline during the build ERROR: Connection was broken: java.io.IOException: Unexpected termination of the channel at hudson.remoting.SynchronousCommandTransport$ReaderThread.run(SynchronousCommandTransport.java:50) Caused by: java.io.EOFException at java.io.ObjectInputStream$PeekInputStream.readFully(ObjectInputStream.java:2351) at java.io.ObjectInputStream$BlockDataInputStream.readShort(ObjectInputStream.java:2820) at java.io.ObjectInputStream.readStreamHeader(ObjectInputStream.java:804) at java.io.ObjectInputStream.<init>(ObjectInputStream.java:302) at hudson.remoting.ObjectInputStreamEx.<init>(ObjectInputStreamEx.java:48) at hudson.remoting.AbstractSynchronousByteArrayCommandTransport.read(AbstractSynchronousByteArrayCommandTransport.java:34) at hudson.remoting.SynchronousCommandTransport$ReaderThread.run(SynchronousCommandTransport.java:48) Build step 'Execute shell' marked build as failure ERROR: Step ‘Archive the artifacts’ failed: no workspace for EinsteinToolkit #799 ERROR: Step ‘Publish JUnit test result report’ failed: no workspace for EinsteinToolkit #799 IRC notifier plugin: Sending notification to: #cactus IRC notifier plugin: [ERROR] not connected. Cannot send message to '#cactus' [BFA] Scanning build for known causes... [BFA] No failure causes found [BFA] Done. 0s Started calculate disk usage of build Finished Calculation of disk usage of build in 0 seconds Email was triggered for: Failure - Any Sending email for trigger: Failure - Any