BUILD FAILURE

Build URL:https://build.barrywardell.net/job/EinsteinToolkit/1608/
Project:EinsteinToolkit
Date of build:Fri, 01 May 2020 17:07:16 +0000
Build duration:1 min 6 sec

Changes

Revision: 4795ad8174e812d06d60253de06695e1c25d9eb7
Author:Einstein Toolkit Git Server
Log:
Updated submodules:

* arrangements/CactusTest ff88931...60bb6d9 (1):
  > TestReadWrite: reinstate unused-are-null test for Test_B


Console Output


	[...truncated 100.79 KB...]

	PAPI selected, but PAPI_DIR not set. Checking some places...

	PAPI not found

	Using bundled PAPI...

	Finished running configuration script for thorn PAPI.

	

	********************************************************************************

	Running configuration script for thorn PTHREADS:

	Finished running configuration script for thorn PTHREADS.

	

	********************************************************************************

	Running configuration script for thorn VECTORS:

	Finished running configuration script for thorn VECTORS.

	

	********************************************************************************

	Running configuration script for thorn ZLIB:

	zlib selected, but ZLIB_DIR not set. Checking some places...

	Found zlib in /usr

	Finished running configuration script for thorn ZLIB.

	

	********************************************************************************

	Running configuration script for thorn HWLOC:

	hwloc selected, but HWLOC_DIR not set. Checking some places...

	pkg-config not found; attempting to use reasonable defaults

	hwloc not found

	Using bundled hwloc...

	Finished running configuration script for thorn HWLOC.

	

	********************************************************************************

	Running configuration script for thorn MPI:

	MPI selected, but MPI_DIR is not set. Computing settings...

	Found MPI compiler wrapper at /usr/bin/mpic++!

	Successfully configured MPI.

	Finished running configuration script for thorn MPI.

	

	********************************************************************************

	Running configuration script for thorn HDF5:

	Additional requested language support:  Fortran

	HDF5 selected, but HDF5_DIR not set. Checking pkg-config ...

	HDF5 found: /usr

	Finished running configuration script for thorn HDF5.

	Checking consistency...

	Creating Thorn-Flesh bindings...

	Creating implementation bindings...

	Creating parameter bindings...

	Creating variable bindings...

	Creating schedule bindings...

	Creating function bindings...

	

	CST warning in /home/jenkins/workspace/EinsteinToolkit/arrangements/CactusTest/TestReadWrite/schedule.ccl (at 59)

	-> Error in read/write declaration of 'TESTREADWRITE::var3' for 'TestReadWrite_TestC_C' in schedule.

	

	

	CST error in /home/jenkins/workspace/EinsteinToolkit/arrangements/CactusTest/TestReadWrite/schedule.ccl (at 126)

	-> Error in TestReadWrite_TestF_C schedule. Check variable or group 'TESTREADWRITE::var3' and verify correct implementation/thorn name and variable name.

	

	Generating arguments...

	

	

	------------------------------------------------------

	There was 1 error during execution of the CST

	This must be corrected before compilation can proceed

	------------------------------------------------------

	

	

	

	------------------------------------------------------

	Warnings were generated during execution of the CST

	------------------------------------------------------

	

	

	CST warning in /home/jenkins/workspace/EinsteinToolkit/arrangements/CactusTest/TestReadWrite/schedule.ccl (at 59)

	-> Error in read/write declaration of 'TESTREADWRITE::var3' for 'TestReadWrite_TestC_C' in schedule.

	HINT:  Did you mean TESTREADWRITEIMP::var3? [ERR2]  Did you mean TESTREADWRITEIMP::var3? [ERR1]

	

	

	CST error in /home/jenkins/workspace/EinsteinToolkit/arrangements/CactusTest/TestReadWrite/schedule.ccl (at 126)

	-> Error in TestReadWrite_TestF_C schedule. Check variable or group 'TESTREADWRITE::var3' and verify correct implementation/thorn name and variable name.

	HINT:  Did you mean TESTREADWRITEIMP::var3? [ERR3]  Did you mean TESTREADWRITEIMP::var3? [ERR4]

	

	------------------------------------------------------

	

	/home/jenkins/workspace/EinsteinToolkit/lib/make/make.configuration:212: recipe for target '/home/jenkins/workspace/EinsteinToolkit/configs/sim/config-data/make.thornlist' failed

	make[1]: *** [/home/jenkins/workspace/EinsteinToolkit/configs/sim/config-data/make.thornlist] Error 1

	Makefile:259: recipe for target 'sim' failed

	make: *** [sim] Error 2

	Build step 'Execute shell' marked build as failure

	Archiving artifacts

	Recording test results

	ERROR: Step ?Publish JUnit test result report? failed: Test reports were found but none of them are new. Did leafNodes run?

	For example, /home/jenkins/workspace/EinsteinToolkit/testresults.xml is 23 hr old

	

	IRC notifier plugin: Sending notification to: #cactus

	IRC notifier plugin: [ERROR] not connected. Cannot send message to '#cactus'

	Started calculate disk usage of build

	Finished Calculation of disk usage of build in 0 seconds

	Started calculate disk usage of workspace

	Finished Calculation of disk usage of workspace in  1 second

	Email was triggered for: Failure - Any

	Sending email for trigger: Failure - Any