BUILD FAILURE
Changes
| Revision: |
e90005163b51758fec013c159eb6cce28dc9511d |
| Author: | Einstein Toolkit Git Server |
| Log: | Updated submodules:
* arrangements/WVUThorns 9bf3849...6e4f288 (1):
> WVUThorns/BaikalVacuum/test: Add test for BaikalVacuum
|
Console Output
[...truncated 105.78 KB...]
Checking status of thorn Nice
Checking status of thorn Noise
Checking status of thorn Norms
Checking status of thorn NullDecomp
Checking status of thorn NullGrid
Checking status of thorn NullVars
Checking status of thorn OpenSSL
Checking status of thorn Outflow
Checking status of thorn PAPI
Checking status of thorn TATelliptic
Checking status of thorn ProcaBase
Checking status of thorn ProcaEvolve
Checking status of thorn Proca_simpleID
Checking status of thorn PunctureTracker
Checking status of thorn ReductionTest
Checking status of thorn ReductionTest2
Checking status of thorn ReductionTest3
Checking status of thorn ReflectionSymmetry
Checking status of thorn RegridSyncTest
Checking status of thorn RotatingDBHIVP
Checking status of thorn SampleBoundary
Checking status of thorn SampleIO
Checking status of thorn Seed_Magnetic_Fields
Checking status of thorn Seed_Magnetic_Fields_BNS
Checking status of thorn SetMask_SphericalSurface
Checking status of thorn SlabTest
Checking status of thorn StaticConformal
Checking status of thorn SymBase
Checking status of thorn SystemStatistics
Checking status of thorn TerminationTrigger
Checking status of thorn TestArrays
Checking status of thorn TestComplex
Checking status of thorn TestCoordinates
Checking status of thorn TestFortranCrayPointers
Checking status of thorn TestFortranDependencies2
Checking status of thorn TestFpointerNULL
Checking status of thorn TestFreeF90
Checking status of thorn TestGlobalReduce
Checking status of thorn TestInclude1
Checking status of thorn TestInclude2
Checking status of thorn TestLocalInterp2
Checking status of thorn TestLocalReduce
Checking status of thorn TestLoop
Checking status of thorn TestMath
Checking status of thorn TestMoL
Checking status of thorn TestPar
Checking status of thorn TestReadWrite
Checking status of thorn TestReduce
COMPILING CactusTest/TestReadWrite/src/TestC.cc
Checking status of thorn TestSchedule
Checking status of thorn TestStrings
COMPILING CactusTest/TestStrings/src/CRoutines.c
/home/jenkins/workspace/EinsteinToolkit/configs/sim/build/TestReadWrite/TestC.cc: In function 'void TestReadWrite_TestC_C(cGH*)':
/home/jenkins/workspace/EinsteinToolkit/configs/sim/build/TestReadWrite/TestC.cc:69:96: error: expected ',' before ')' token
static_assert(!std::is_const<std::remove_reference<decltype(*VarCurrentLevelC)>::type>::value);
^
/home/jenkins/workspace/EinsteinToolkit/configs/sim/build/TestReadWrite/TestC.cc:69:96: error: expected string-literal before ')' token
/home/jenkins/workspace/EinsteinToolkit/configs/sim/build/TestReadWrite/TestC.cc:71:83: error: expected ',' before ')' token
static_assert(std::is_const<std::remove_reference<decltype(*Var1)>::type>::value);
^
/home/jenkins/workspace/EinsteinToolkit/configs/sim/build/TestReadWrite/TestC.cc:71:83: error: expected string-literal before ')' token
/home/jenkins/workspace/EinsteinToolkit/configs/sim/build/TestReadWrite/TestC.cc:72:85: error: expected ',' before ')' token
static_assert(std::is_const<std::remove_reference<decltype(*Var1_p)>::type>::value);
^
/home/jenkins/workspace/EinsteinToolkit/configs/sim/build/TestReadWrite/TestC.cc:72:85: error: expected string-literal before ')' token
/home/jenkins/workspace/EinsteinToolkit/configs/sim/build/TestReadWrite/TestC.cc:74:88: error: expected ',' before ')' token
std::is_const<std::remove_reference<decltype(*groupVar2)>::type>::value);
^
/home/jenkins/workspace/EinsteinToolkit/configs/sim/build/TestReadWrite/TestC.cc:74:88: error: expected string-literal before ')' token
/home/jenkins/workspace/EinsteinToolkit/configs/sim/build/TestReadWrite/TestC.cc:76:92: error: expected ',' before ')' token
std::is_const<std::remove_reference<decltype(*groupVar2_p_p)>::type>::value);
^
/home/jenkins/workspace/EinsteinToolkit/configs/sim/build/TestReadWrite/TestC.cc:76:92: error: expected string-literal before ')' token
/home/jenkins/workspace/EinsteinToolkit/configs/sim/config-data/make.config.rules:278: recipe for target 'TestC.cc.o' failed
make[3]: *** [TestC.cc.o] Error 1
/home/jenkins/workspace/EinsteinToolkit/lib/make/make.thornlib:112: recipe for target 'make.checked' failed
make[2]: *** [make.checked] Error 2
/home/jenkins/workspace/EinsteinToolkit/lib/make/make.configuration:179: recipe for target '/home/jenkins/workspace/EinsteinToolkit/configs/sim/lib/libthorn_TestReadWrite.a' failed
make[1]: *** [/home/jenkins/workspace/EinsteinToolkit/configs/sim/lib/libthorn_TestReadWrite.a] Error 2
make[1]: *** Waiting for unfinished jobs....
COMPILING CactusTest/TestStrings/src/FCalls.F
COMPILING configs/sim/bindings/build/TestStrings/cctk_ThornBindings.c
Updating /home/jenkins/workspace/EinsteinToolkit/configs/sim/lib/libthorn_TestStrings.a
Makefile:259: recipe for target 'sim' failed
make: *** [sim] Error 2
Build step 'Execute shell' marked build as failure
Archiving artifacts
Recording test results
ERROR: Step ?Publish JUnit test result report? failed: Test reports were found but none of them are new. Did leafNodes run?
For example, /home/jenkins/workspace/EinsteinToolkit/testresults.xml is 2 days 4 hr old
IRC notifier plugin: Sending notification to: #cactus
IRC notifier plugin: [ERROR] not connected. Cannot send message to '#cactus'
Started calculate disk usage of build
Finished Calculation of disk usage of build in 0 seconds
Started calculate disk usage of workspace
Finished Calculation of disk usage of workspace in 1 second
Email was triggered for: Failure - Any
Sending email for trigger: Failure - Any